{"text_format":"1","workbook":"xlsx","n_sheets":7,"sheets":["Einstellung","Sollwerte","Ration","Mischung 1","Gruber Tabelle","Mengenberechnung","Ausdruck"],"not_rendered":{"charts":0,"images":20,"macros":1,"external_links":0,"defined_names":4,"comments":3,"pivot_tables":0},"unopened":[],"bounds":{"document_bytes":16777216,"sheet_cells":100000,"rows_first":2000,"rows_last":500,"rows_between":2000,"halvings":0,"cell_chars":16384,"cell_head_chars":4096},"cells_cut":0,"cells_raw":0,"read":"whole","date_system":"1900"}

{"sheet":"Einstellung","index":0,"n_rows":23,"n_cols":8,"rows_kept":23,"cut":false,"hidden":false,"merged":[[24,1,24,12],[1,1,1,16],[3,7,3,16],[4,1,7,1],[8,2,9,5],[10,2,11,5],[4,4,4,5],[4,2,4,3],[5,2,5,5],[6,3,6,5],[7,3,7,5],[12,2,13,5],[4,7,4,16],[2,7,2,16],[15,2,15,5],[22,2,22,5],[17,2,17,5],[0,0,23,0]]}
[]
[]
[]
[null,null,null,null,null,null,null,"Futterberechnung zur Fütterung der Schafe und Ziegen"]
[null,null,"Tierhaltungsschule",null,"Triesdorf",null,null,"Gruber Tabelle    -     www.LfL.Bayern.de"]
[null,null,"Markgrafenstraße 1"]
[null,null,91746,"Weidenbach"]
[null,null,"Betr. Nr.","091231234444"]
[]
[]
[null,null,"Freie Software"]
[]
[null,null,"keine Gewährleistung!"]
[]
[]
{"$rows_left_out":9}
{"sheet":"Sollwerte","index":1,"n_rows":75,"n_cols":22,"rows_kept":75,"cut":false,"hidden":false,"merged":[[1,15,2,21],[2,0,2,14]]}
[]
[null,null,null,null,null,null,null,null,null,null,null,null,null,null,null,"Spurenelemente  mg / kg TM"]
["Richtwerte zur Nährstoffversorgung aus Gruber Tabelle S. 60 ff        Alle Felder können mit eigenen Werten überschrieben werden.        "]
["Tier","Kenn - Nr.","TM / Tag g","aNDFom","CP","nXP","ME/MJ","ST"," Ca g","P g","Mg g","Na g","K g","Cl g","S g","Fe","Cu","Zn","Mn","Co","J","Se"]
["Sollwerte aus Liste wählen  >>>",0,0,0,0,0,0,null,0,0,0,0,0,null,null,0,0,0,0,0,0,0]
["Mutterschaf 70 kg (leer/niedertragend)",1,1250,250,90,90,11,null,5,4,1,1,10,null,null,40,5,45,40,0.15,0.5,0.15]
["Mutterschaf 70 kg (hochtragend 5. Monat)",2,1650,250,160,160,15.5,null,9,6,1.5,2,10,null,null,40,5,45,40,0.15,0.5,0.15]
["Mutterschaf 70 kg (säugend, 1 Lamm)",3,2100,250,300,300,22.4,null,16,9,2.5,2,15,null,null,40,5,45,40,0.15,0.5,0.15]
["Mutterschaf 70 kg (säugend, 2 Lämmer)",4,2400,250,370,370,26.4,null,19.7,10.7,3,2.2999999999999998,15,null,null,40,5,45,40,0.15,0.5,0.15]
[5,5]
["Mutterschaf 85 kg (leer/niedertragend)",6,1440,250,105,105,12.7,null,5,4,1,1,10,null,null,40,5,45,40,0.15,0.5,0.15]
["Mutterschaf 85 kg (hochtragend 5. Monat)",7,1940,250,170,170,18.3,null,9,6,1.5,2,10,null,null,40,5,45,40,0.15,0.5,0.15]
["Mutterschaf 85 kg (säugend, 1 Lamm)",8,2280,250,315,315,24,null,16,9,2.5,2,15,null,null,40,5,45,40,0.15,0.5,0.15]
["Mutterschaf 85 kg (säugend, 2 Lämmer)",9,2580,250,385,385,28,null,19.7,10.7,3,2.2999999999999998,15,null,null,40,5,45,40,0.15,0.5,0.15]
[10,10]
{"$rows_left_out":61}
{"sheet":"Ration","index":2,"n_rows":33,"n_cols":25,"rows_kept":33,"cut":false,"hidden":false,"merged":[[0,4,0,16],[0,17,1,17],[14,0,14,2],[13,0,13,2],[1,5,1,16],[18,0,18,2],[19,0,20,3],[1,18,1,24],[23,2,32,3],[16,0,16,2],[19,6,20,6],[15,0,15,2],[19,5,20,5],[15,3,15,5]]}
[null,"Bitte eine Tierart aus der Liste wählen!"]
[1,null,null,null,null,{"$f":"A19","v":"Sollwerte aus Liste wählen  >>>"},null,null,null,null,null,null,null,null,null,null,null,null,"Spurenelemente   mg / kg TM"]
["Nr.","Futterart","TM %","FM kg","TM g","OM g","aNDFom g","CP g","nXP g","ME Mj","ST","Ca","P","Mg","Na","K","Preis","aNDFomGF","Fe","Cu","Zn","Mn","Co","J","Se"]
[{"$f":"A24","v":0},{"$f":"B24","v":""},null,null,{"$f":"IF(D4>0,(D4*C4)*1000,0)","v":0},{"$f":"IF(D4>0,(F24*C4)*D4,0)","v":0},{"$f":"IF(D4>0,(G24*C4)*D4,0)","v":0},{"$f":"IF(D4>0,(H24*C4)*D4,0)","v":0},{"$f":"IF(D4>0,(I24*C4)*D4,0)","v":0},{"$f":"IF(D4>0,(J24*C4)*D4,0)","v":0},{"$f":"IF(D4>0,(K24*C4)*D4,0)","v":0},{"$f":"IF(D4>0,(L24*C4)*D4,0)","v":0},{"$f":"IF(D4>0,(M24*C4)*D4,0)","v":0},{"$f":"IF(D4>0,(N24*C4)*D4,0)","v":0},{"$f":"IF(D4>0,(O24*C4)*D4,0)","v":0},{"$f":"IF(D4>0,(P24*C4)*D4,0)","v":0},{"$f":"IF(D4>0,Q24*D4/100,0)","v":0},{"$f":"IFERROR(IF(R24=\"GF\",G24*E4/1000,0),0)","v":0},{"$f":"IF(D4>0,(S24*C4)*D4,0)","v":0},{"$f":"IF(D4>0,(T24*C4)*D4,0)","v":0},{"$f":"IF(D4>0,(U24*C4)*D4,0)","v":0},{"$f":"IF(D4>0,(V24*C4)*D4,0)","v":0},{"$f":"IF(D4>0,(W24*C4)*D4,0)","v":0},{"$f":"IF(D4>0,(X24*C4)*D4,0)","v":0},{"$f":"IF(D4>0,(Y24*C4)*D4,0)","v":0}]
[{"$f":"A25","v":0},"",null,null,{"$f":"IF(D5>0,(D5*C5)*1000,0)","v":0},0,0,0,0,0,{"$f":"IF(D5>0,(K25*C5)*D5,0)","v":0},{"$f":"IF(D5>0,(L25*C5)*D5,0)","v":0},{"$f":"IF(D5>0,(M25*C5)*D5,0)","v":0},0,0,0,0,0,{"$f":"IF(G5>0,(S25*C5)*D5,0)","v":0},{"$f":"IF(D5>0,(T25*C5)*D5,0)","v":0},{"$f":"IF(D5>0,(U25*C5)*D5,0)","v":0},{"$f":"IF(D5>0,(V25*C5)*D5,0)","v":0},{"$f":"IF(D5>0,(W25*C5)*D5,0)","v":0},{"$f":"IF(D5>0,(X25*C5)*D5,0)","v":0},{"$f":"IF(D5>0,(Y25*C5)*D5,0)","v":0}]
[{"$f":"A26","v":0},"",null,null,0,0,0,0,0,0,0,0,0,0,0,0,0,0,0,0,0,0,0,0,0]
[{"$f":"A27","v":0},"",null,null,0,0,0,0,0,0,0,0,0,0,0,0,0,0,0,0,0,0,0,0,0]
[{"$f":"A28","v":0},"",null,null,0,0,0,0,0,0,0,0,0,0,0,0,0,0,0,0,0,0,0,0,0]
[{"$f":"A29","v":0},"",null,null,0,0,0,0,0,0,0,0,0,0,0,0,0,0,0,0,0,0,0,0,0]
[{"$f":"A30","v":0},"",null,null,0,0,0,0,0,0,0,0,0,0,0,0,0,0,0,0,0,0,0,0,0]
[{"$f":"A31","v":0},"",null,null,0,0,0,0,0,0,0,0,0,0,0,0,0,0,0,0,0,0,0,0,0]
[{"$f":"A32","v":0},"",null,null,0,0,0,0,0,0,0,0,0,0,0,0,0,0,0,0,0,0,0,0,0]
[{"$f":"A33","v":0},"",null,null,0,0,0,0,0,0,0,0,0,0,0,0,0,0,0,0,0,0,0,0,0]
["Summen und Gehaltswerte:",null,null,{"$f":"SUM(D4:D13)","v":0},{"$f":"SUM(E4:E13)","v":0},{"$f":"SUM(F4:F13)","v":0},{"$f":"SUM(G4:G13)","v":0},{"$f":"SUM(H4:H13)","v":0},0,0,0,0,0,0,0,0,0,{"$f":"SUM(R4:R13)","v":0},{"$f":"SUM(S4:S13)","v":0},{"$f":"SUM(T4:T13)","v":0},0,0,0,0,0]
["Konzentrat - Mischung  kg:",null,null,null,{"$f":"IF(D15>0,'Mischung 1'!F14*D15,0)","v":0},{"$f":"IF(E15>0,'Mischung 1'!G14*D15,0)","v":0},{"$f":"IF(D15>0,'Mischung 1'!H14*D15,0)","v":0},{"$f":"IF(D15>0,'Mischung 1'!I14*D15,0)","v":0},{"$f":"IF(D15>0,'Mischung 1'!J14*D15,0)","v":0},{"$f":"IF(D15>0,'Mischung 1'!K14*D15,0)","v":0},{"$f":"IF(D15>0,'Mischung 1'!L14*D15,0)","v":0},{"$f":"IF(D15>0,'Mischung 1'!M14*D15,0)","v":0},{"$f":"IF(D15>0,'Mischung 1'!N14*D15,0)","v":0},{"$f":"IF(D15>0,'Mischung 1'!O14*D15,0)","v":0},{"$f":"IF(D15>0,'Mischung 1'!P14*D15,0)","v":0},{"$f":"IF(D15>0,'Mischung 1'!Q14*D15,0)","v":0},{"$f":"IF('Mischung 1'!R14>0,'Mischung 1'!R14*D15,0)","v":0},null,{"$f":"IF(D15>0,'Mischung 1'!T14*D15,0)","v":0},{"$f":"IF(D15>0,'Mischung 1'!U14*D15,0)","v":0},{"$f":"IF(D15>0,'Mischung 1'!V14*D15,0)","v":0},{"$f":"IF(D15>0,'Mischung 1'!W14*D15,0)","v":0},{"$f":"IF(D15>0,'Mischung 1'!X14*D15,0)","v":0},{"$f":"IF(D15>0,'Mischung 1'!Y14*D15,0)","v":0},{"$f":"IF(D15>0,'Mischung 1'!Z14*D15,0)","v":0}]
{"$rows_left_out":19}
{"sheet":"Mischung 1","index":3,"n_rows":33,"n_cols":26,"rows_kept":33,"cut":false,"hidden":false,"merged":[[23,2,32,4],[0,0,1,4]]}
["Konzentrat - Mischung"]
[]
["Nr ","Futterart","Mischungs- Anteil in %","TM %","FM kg","TM g","OM g","aNDFom g","CP g","nXP g","ME Mj","ST","Ca","P","Mg","Na","K","Kosten","aNDFom","Fe","Cu","Zn","Mn","Co ","J","Se"]
[{"$f":"A24","v":0},{"$f":"B24","v":""},null,{"$f":"IFERROR(VLOOKUP(A24,'Gruber Tabelle'!$A$4:$M$362,3,0)/1000,\"\")","v":""},{"$f":"IF(C4>0,1*C4,\" \")","v":" "},{"$f":"IFERROR(IF(C4>0,F24*C4,\" \"),\"\")","v":" "},{"$f":"IFERROR(IF($G$24>0,(G24*C4)*D4,\" \"),\"\")","v":""},{"$f":"IFERROR(IF(H24>0,(H24*C4)*D4,\" \"),\"\")","v":""},{"$f":"IFERROR(IF(I24>0,(I24*C4)*D4,\" \"),\"\")","v":""},{"$f":"IFERROR(IF(J24>0,(J24*C4)*D4,\" \"),\"\")","v":""},{"$f":"IFERROR(IF(K24>0,(K24*C4)*D4,\" \"),\"\")","v":""},{"$f":"IFERROR(IF(L24>0,(L24*C4)*D4,\" \"),\"\")","v":""},{"$f":"IFERROR(IF(M24>0,(M24*C4)*D4,\" \"),\"\")","v":""},{"$f":"IFERROR(IF(N24>0,(N24*C4)*D4,\" \"),\"\")","v":""},{"$f":"IFERROR(IF(O24>0,(O24*C4)*D4,\" \"),\"\")","v":""},{"$f":"IFERROR(IF(P24>0,(P24*C4)*D4,\" \"),\"\")","v":""},{"$f":"IFERROR(IF(Q24>0,(Q24*C4)*D4,\" \"),\"\")","v":""},{"$f":"IFERROR(IF(C4>0,R24*E4/100,0),\"\")","v":0},{"$f":"IF(S24=\"GF\",H24*F24/1000,0)","v":0},{"$f":"IFERROR(IF(T24>0,(T24*C4)*D4,\" \"),\"\")","v":""},{"$f":"IFERROR(IF(U24>0,(U24*C4)*D4,\" \"),\"\")","v":""},{"$f":"IFERROR(IF(V24>0,(V24*C4)*D4,\" \"),\"\")","v":""},{"$f":"IFERROR(IF(W24>0,(W24*C4)*D4,\" \"),\"\")","v":""},{"$f":"IFERROR(IF(X24>0,(X24*C4)*D4,\" \"),\"\")","v":""},{"$f":"IFERROR(IF(Y24>0,(Y24*C4)*D4,\" \"),\"\")","v":""},{"$f":"IFERROR(IF(Z24>0,(Z24*C4)*D4,\" \"),\"\")","v":""}]
[{"$f":"A25","v":0},"",null,{"$f":"IFERROR(VLOOKUP(A25,'Gruber Tabelle'!$A$4:$M$362,3,0)/1000,\"\")","v":""},{"$f":"IF(C5>0,1*C5,\" \")","v":" "}," ",{"$f":"IFERROR(IF($G$25>0,(G25*C5)*D5,\" \"),\"\")","v":""},"","","","","","","","","","",0,{"$f":"IF(S25=\"GF\",H25*F25/1000,0)","v":0},{"$f":"IFERROR(IF(T25>0,(T25*C5)*D5,\" \"),\"\")","v":""},{"$f":"IFERROR(IF(U25>0,(U25*C5)*D5,\" \"),\"\")","v":""},{"$f":"IFERROR(IF(V25>0,(V25*C5)*D5,\" \"),\"\")","v":""},{"$f":"IFERROR(IF(W25>0,(W25*C5)*D5,\" \"),\"\")","v":""},{"$f":"IFERROR(IF(X25>0,(X25*C5)*D5,\" \"),\"\")","v":""},{"$f":"IFERROR(IF(Y25>0,(Y25*C5)*D5,\" \"),\"\")","v":""},{"$f":"IFERROR(IF(Z25>0,(Z25*C5)*D5,\" \"),\"\")","v":""}]
[{"$f":"A26","v":0},"",null,{"$f":"IFERROR(VLOOKUP(A26,'Gruber Tabelle'!$A$4:$M$362,3,0)/1000,\"\")","v":""}," "," ",{"$f":"IFERROR(IF($G$26>0,(G26*C6)*D6,\" \"),\"\")","v":""},"","","","","","","","","","",0,0,"","","","","","",""]
[{"$f":"A27","v":0},"",null,{"$f":"IFERROR(VLOOKUP(A27,'Gruber Tabelle'!$A$4:$M$362,3,0)/1000,\"\")","v":""}," "," ",{"$f":"IFERROR(IF($G$27>0,(G27*C7)*D7,\" \"),\"\")","v":""},"","","","","","","","","","",0,0,"","","","","","",""]
[{"$f":"A28","v":0},"",null,{"$f":"IFERROR(VLOOKUP(A28,'Gruber Tabelle'!$A$4:$M$362,3,0)/1000,\"\")","v":""}," "," ",{"$f":"IFERROR(IF($G$28>0,(G28*C8)*D8,\" \"),\"\")","v":""},"","","","","","","","","","",0,0,"","","","","","",""]
[{"$f":"A29","v":0},"",null,{"$f":"IFERROR(VLOOKUP(A29,'Gruber Tabelle'!$A$4:$M$362,3,0)/1000,\"\")","v":""}," "," ",{"$f":"IFERROR(IF($G$29>0,(G29*C9)*D9,\" \"),\"\")","v":""},"","","","","","","","","","",0,0,"","","","","","",""]
[{"$f":"A30","v":0},"",null,{"$f":"IFERROR(VLOOKUP(A30,'Gruber Tabelle'!$A$4:$M$362,3,0)/1000,\"\")","v":""}," "," ",{"$f":"IFERROR(IF($G$30>0,(G30*C10)*D10,\" \"),\"\")","v":""},"","","","","","","","","","",0,0,"","","","","","",""]
[{"$f":"A31","v":0},"",null,{"$f":"IFERROR(VLOOKUP(A31,'Gruber Tabelle'!$A$4:$M$362,3,0)/1000,\"\")","v":""}," "," ",{"$f":"IFERROR(IF($G$31>0,(G31*C11)*D11,\" \"),\"\")","v":""},null,"","","","","","","","","",0,0,"","","","","","",""]
[{"$f":"A32","v":0},"",null,{"$f":"IFERROR(VLOOKUP(A32,'Gruber Tabelle'!$A$4:$M$362,3,0)/1000,\"\")","v":""}," "," ",{"$f":"IFERROR(IF($G$32>0,(G32*C12)*D12,\" \"),\"\")","v":""},"","","","","","","","","","",0,0,"","","","","","",""]
[{"$f":"A33","v":0},"",null,{"$f":"IFERROR(VLOOKUP(A33,'Gruber Tabelle'!$A$4:$M$362,3,0)/1000,\"\")","v":""}," "," ",{"$f":"IFERROR(IF($G$33>0,(G33*C13)*D13,\" \"),\"\")","v":""},"","","","","","","","","","",0,0,"","","","","","",""]
["FM","Summe:",{"$f":"SUM(C4:C13)","v":0},null,{"$f":"SUM(E4:E13)","v":0},0,0,0,{"$f":"SUM(I4:I13)","v":0},{"$f":"SUM(J4:J13)","v":0},0,0,0,0,0,0,0,{"$f":"SUM(R4:R13)","v":0},{"$f":"SUM(S4:S13)","v":0},{"$f":"SUM(T4:T13)","v":0},0,0,0,0,0,0]
[]
{"$rows_left_out":19}
{"sheet":"Gruber Tabelle","index":4,"n_rows":344,"n_cols":27,"rows_kept":344,"cut":false,"hidden":false,"merged":[[0,0,1,0],[0,1,1,1]]}
["Ration",null,"TM/FM","CA","OM","aNDFom","CP","CL","ST","ZU","nXP","ME","Ca","P","Mg","Na","K","Fu-Art","Fe","Cu","Zn","Mn","Co","J","Se","Kosten €","Datum"]
[null,null,"g / kg FM","g / kg TM","g / kg TM","g / kg TM","g / kg TM","g / kg TM","g / kg TM","g / kg TM","g / kg TM","MJ/ kg TM","g / kg TM","g / kg TM","g / kg TM","g / kg TM","g / kg TM",null,"mg / kg TM","mg / kg TM","mg / kg TM","mg / kg TM","mg / kg TM","mg / kg TM","mg / kg TM","€ / dt"]
[1013,"Wiesengras, 1.Schnitt, im Blattstadium",175,111,{"$f":"1000-D3","v":889},433,228,33,0,137,153.62,11.57,6.9,3.8,2.4,0.9,31.5,"GF",100,8,35,59.1,0.12,0.4,0.03,0,"2024-02-11"]
[1014,"Wiesengras, 1.Schnitt, im Schossen",180,103,{"$f":"1000-D4","v":897},439,192,32,0,137,145.63999999999999,11.19,6.7,3.6,2.4,0.84,31.1,"GF",100,7.9,34.700000000000003,61.5,0.12,0.4,0.03,0,"2024-02-11"]
[1015,"Wiesengras, 1.Schnitt",185,95,905,457,167,30,0,137,143.71,10.81,6.5,3.4,2.2000000000000002,0.66,29.6,"GF",100,7.7,33,65,0.12,0.4,0.03,0,"2024-02-11"]
[1016,"Wiesengras, 1.Schnitt, Beginn Blüte",190,88,912,486,146,28,0,137,136.54,10.45,6.4,3.3,2.1,0.54,28.8,"GF",100,7.5,32.4,69.8,0.12,0.4,0.03,0,"2024-02-11"]
[1017,"Wiesengras, 1.Schnitt, Ende Blüte",200,78,922,515,120,25,0,137,127.17,9.9600000000000009,6,3.1,2,0.46,27.6,"GF",100,7.3,30.2,72,0.12,0.4,0.03,0,"2024-02-11"]
[1023,"Wiesengras, 2.und FolgeSchnitte, im Blattstadium",200,99,901,488,179,40,0,63,140.03,10.81,7.6,3.7,2.8,0.89,29,"GF",100,8.1999999999999993,37.6,54.8,0.12,0.4,0.03,0,"2024-02-11"]
[1024,"Wiesengras, 2.und FolgeSchnitte, im Schossen",200,97,903,491,159,37,0,63,134.82,10.53,7.6,3.5,2.8,0.79,28,"GF",100,8.1,35.200000000000003,69.2,0.12,0.4,0.03,0,"2024-02-11"]
[1025,"Wiesengras. 2.Schnitt",200,94,906,510,144,35,0,63,133.38999999999999,10.19,7.3,3.4,2.6,0.62,27.4,"GF",100,8,33.1,71.099999999999994,0.12,0.4,0.03,0,"2024-02-11"]
[1026,"Wiesengras, 2.und FolgeSchnitte, Beginn Blüte",200,91,909,537,124,31,0,63,126.59,9.85,6.9,3.2,2.4,0.55000000000000004,25.6,"GF",100,7.6,31.8,80.7,0.12,0.4,0.03,0,"2024-02-11"]
[1028,"Wiesengras, 3. Schnitt",200,100,900,480,168,31,0,72,135.9,10.08,8.1999999999999993,3.4,2.9,0.78,24.3,"GF",250,8.1,32.5,72,0.12,0.4,0.03,0,"2024-02-11"]
[1029,"Wiesengras, ab 4. Schnitt",180,110,890,470,202,33,0,86,144.63999999999999,10.4,8.5,3.7,3,1,26.8,"GF",300,8.4,33,74.099999999999994,0.12,0.4,0.03,0,"2024-02-11"]
[1055,"Weidegras, 1. Aufwuchs",190,90,910,400,196,35,0,121,149.54,11.5,7,3.7,2.4,0.7,30,"GF",150,7.9,42,40,0.12,0.4,0.03,0,"2024-02-11"]
[1065,"Weidegras, ab 2.Aufwuchs",200,100,900,430,192,35,0,94,141.47999999999999,10.82,7.6,4.2,3,0.8,25,"GF",250,8.4,42,50,0.12,0.4,0.03,0,"2024-02-11"]
{"$rows_left_out":330}
{"sheet":"Mengenberechnung","index":5,"n_rows":27,"n_cols":7,"rows_kept":27,"cut":false,"hidden":false,"merged":[[23,1,23,3],[23,5,26,6],[24,1,24,3],[25,1,25,3],[26,1,26,3],[19,1,19,3],[19,5,22,6],[20,1,20,3],[21,1,21,3],[22,1,22,3],[15,0,15,4],[16,1,16,3],[16,5,16,6],[17,1,17,3],[18,1,18,3],[10,1,10,3],[10,5,14,6],[11,1,11,3],[12,1,12,3],[13,1,13,3],[14,1,14,3],[0,0,0,6],[1,0,1,4],[2,1,2,3],[2,5,2,6],[3,1,3,3],[3,5,9,6],[4,1,4,3],[5,1,5,3],[6,1,6,3],[7,1,7,3],[8,1,8,3],[9,1,9,3]]}
[]
["Basis – Ration für :",null,null,null,null,50,"Tiere"]
["Kenn Nr.","Futtermittel",null,null,"kg."]
[{"$f":"Ration!A4","v":0},{"$f":"Ration!B4","v":""},null,null,{"$f":"Ration!D4*F2","v":0},"Gesamtgewicht Grundfutter und Kraftfutter pro Mischung in kg:"]
[{"$f":"Ration!A5","v":0},{"$f":"Ration!B5","v":""},null,null,{"$f":"Ration!D5*F2","v":0}]
[{"$f":"Ration!A6","v":0},{"$f":"Ration!B6","v":""},null,null,{"$f":"Ration!D6*F2","v":0}]
[{"$f":"Ration!A7","v":0},{"$f":"Ration!B7","v":""},null,null,{"$f":"Ration!D7*F2","v":0}]
[{"$f":"Ration!A8","v":0},{"$f":"Ration!B8","v":""},null,null,{"$f":"Ration!D8*F2","v":0}]
[{"$f":"Ration!A9","v":0},{"$f":"Ration!B9","v":""},null,null,{"$f":"Ration!D9*F2","v":0}]
[{"$f":"Ration!A10","v":0},{"$f":"Ration!B10","v":""},null,null,{"$f":"Ration!D10*F2","v":0}]
[{"$f":"Ration!A11","v":0},{"$f":"Ration!B11","v":""},null,null,{"$f":"Ration!D11*F2","v":0},{"$f":"SUM(E4:E15)","v":0}]
[{"$f":"Ration!A12","v":0},{"$f":"Ration!B12","v":""},null,null,{"$f":"Ration!D12*F2","v":0}]
[{"$f":"Ration!A13","v":0},{"$f":"Ration!B13","v":""},null,null,{"$f":"Ration!D13*F2","v":0}]
["KF 1","Mischung 1",null,null,{"$f":"Ration!D15*F2","v":0}]
[]
{"$rows_left_out":13}
{"sheet":"Ausdruck","index":6,"n_rows":32,"n_cols":26,"rows_kept":32,"cut":false,"hidden":false,"merged":[[31,13,31,14],[28,0,28,1],[31,5,31,10],[31,11,31,12],[18,5,18,9],[18,10,18,12],[2,0,2,4],[3,0,3,1],[3,2,3,4],[5,1,5,4],[3,5,3,9],[3,10,3,12],[5,14,5,17],[6,14,6,17],[7,14,7,17],[8,14,8,17],[9,14,9,17],[10,14,10,17],[11,14,11,17],[12,14,12,17],[13,14,13,17],[14,14,14,17],[15,14,15,17],[16,14,16,17],[26,5,26,10],[27,5,27,10],[26,2,26,3],[26,11,26,12],[27,11,27,12],[30,11,30,12],[29,11,29,12],[28,11,28,12],[26,18,26,20],[27,18,27,20],[28,18,28,20],[28,5,28,10],[29,5,29,10],[30,5,30,10],[29,0,29,1],[28,2,28,3],[29,2,29,3],[30,0,30,1],[30,2,30,3],[27,2,27,3],[2,13,2,17],[3,13,3,14],[18,13,19,17],[20,2,20,3],[19,5,19,10],[19,11,19,12],[20,5,20,10],[21,5,21,10],[22,5,22,10],[23,5,23,10],[24,5,24,10],[25,5,25,10],[22,2,22,3],[23,2,23,3],[24,2,24,3],[25,2,25,3],[21,2,21,3],[20,11,20,12],[18,18,19,20],[20,18,20,20],[21,18,21,20],[22,18,22,20],[23,18,23,20],[24,18,24,20],[0,19,3,25],[0,13,0,14],[0,15,0,17],[1,13,1,15],[1,16,1,17],[3,15,3,17],[18,21,19,25],[20,21,20,25],[0,2,0,4],[1,0,1,2],[1,3,1,4],[0,0,0,1],[19,0,19,3],[0,5,0,7],[0,8,0,12],[1,5,1,9],[2,5,2,9],[1,10,1,12],[2,10,2,12],[6,1,6,4],[7,1,7,4],[8,1,8,4],[10,1,10,4],[16,1,16,4],[17,0,17,2],[18,0,18,4],[15,1,15,4],[11,1,11,4],[9,1,9,4],[12,1,12,4],[13,1,13,4],[14,1,14,4],[21,11,21,12],[22,11,22,12],[23,11,23,12],[24,11,24,12],[25,11,25,12],[21,21,21,25],[22,21,22,25],[23,21,23,25],[24,21,24,25],[25,21,25,25],[26,21,26,25],[27,21,27,25],[28,21,28,25],[29,21,29,25],[29,18,29,20],[29,13,29,17],[20,13,20,17],[21,13,21,17],[22,13,22,17],[23,13,23,17],[24,13,24,17],[25,13,25,17],[26,13,26,17],[27,13,27,17],[28,13,28,17],[25,18,25,20]]}
[{"$f":"Einstellung!C8","v":"Betr. Nr."},null,{"$f":"Einstellung!D8","v":"091231234444"},null,null,"Basis - Ration",null,null,{"$f":"Ration!A19","v":"Sollwerte aus Liste wählen  >>>"},null,null,null,null,{"$f":"Einstellung!C8","v":"Betr. Nr."},null,{"$f":"Einstellung!D8","v":"091231234444"},null,null,null,"Konzentratfutter Mischung"]
[{"$f":"Einstellung!C5","v":"Tierhaltungsschule"},null,null,{"$f":"Einstellung!E5","v":"Triesdorf"},null,"Ration Frischmasse gesamt",null,null,null,null,{"$f":"Ration!D17","v":0},null,null,{"$f":"Einstellung!C5","v":"Tierhaltungsschule"},null,null,{"$f":"Einstellung!E5","v":"Triesdorf"}]
[{"$f":"Einstellung!C6","v":"Markgrafenstraße 1"},null,null,null,null,"Ration Trockenmasse gesamt",null,null,null,null,{"$f":"Ration!E17/1000","v":0},null,null,{"$f":"Einstellung!C6","v":"Markgrafenstraße 1"}]
[{"$f":"Einstellung!C7","v":91746},null,{"$f":"Einstellung!D7","v":"Weidenbach"},null,null,"aNDFom % aus Grobfutter",null,null,null,null,{"$f":"Ration!G20","v":0},null,null,{"$f":"Einstellung!C7","v":91746},null,{"$f":"Einstellung!D7","v":"Weidenbach"}]
[]
["FM","Futtermittel",null,null,null,"CP","nXP","ME","Ca","P","Mg","Na","K","%","Futtermittel",null,null,null,"CP","nXP","ME","Ca","P","Mg","Na","K"]
[{"$f":"Ration!D4","v":0},{"$f":"Ration!B4","v":""},null,null,null,{"$f":"Ration!H4","v":0},{"$f":"Ration!I4","v":0},{"$f":"Ration!J4","v":0},{"$f":"Ration!L4","v":0},{"$f":"Ration!M4","v":0},{"$f":"Ration!N4","v":0},{"$f":"Ration!O4","v":0},{"$f":"Ration!P4","v":0},{"$f":"'Mischung 1'!C4","v":0},{"$f":"'Mischung 1'!B4","v":""},null,null,null,{"$f":"'Mischung 1'!I4","v":""},{"$f":"'Mischung 1'!J4","v":""},{"$f":"'Mischung 1'!K4","v":""},{"$f":"'Mischung 1'!M4","v":""},{"$f":"'Mischung 1'!N4","v":""},{"$f":"'Mischung 1'!O4","v":""},{"$f":"'Mischung 1'!P4","v":""},{"$f":"'Mischung 1'!Q4","v":""}]
[{"$f":"Ration!D5","v":0},{"$f":"Ration!B5","v":""},null,null,null,{"$f":"Ration!H5","v":0},{"$f":"Ration!I5","v":0},{"$f":"Ration!J5","v":0},{"$f":"Ration!L5","v":0},{"$f":"Ration!M5","v":0},{"$f":"Ration!N5","v":0},{"$f":"Ration!O5","v":0},{"$f":"Ration!P5","v":0},{"$f":"'Mischung 1'!C5","v":0},{"$f":"'Mischung 1'!B5","v":""},null,null,null,{"$f":"'Mischung 1'!I5","v":""},{"$f":"'Mischung 1'!J5","v":""},{"$f":"'Mischung 1'!K5","v":""},{"$f":"'Mischung 1'!M5","v":""},{"$f":"'Mischung 1'!N5","v":""},{"$f":"'Mischung 1'!O5","v":""},{"$f":"'Mischung 1'!P5","v":""},{"$f":"'Mischung 1'!Q5","v":""}]
[{"$f":"Ration!D6","v":0},{"$f":"Ration!B6","v":""},null,null,null,{"$f":"Ration!H6","v":0},{"$f":"Ration!I6","v":0},{"$f":"Ration!J6","v":0},{"$f":"Ration!L6","v":0},{"$f":"Ration!M6","v":0},{"$f":"Ration!N6","v":0},{"$f":"Ration!O6","v":0},{"$f":"Ration!P6","v":0},{"$f":"'Mischung 1'!C6","v":0},{"$f":"'Mischung 1'!B6","v":""},null,null,null,{"$f":"'Mischung 1'!I6","v":""},{"$f":"'Mischung 1'!J6","v":""},{"$f":"'Mischung 1'!K6","v":""},{"$f":"'Mischung 1'!M6","v":""},{"$f":"'Mischung 1'!N6","v":""},{"$f":"'Mischung 1'!O6","v":""},{"$f":"'Mischung 1'!P6","v":""},{"$f":"'Mischung 1'!Q6","v":""}]
[{"$f":"Ration!D7","v":0},{"$f":"Ration!B7","v":""},null,null,null,{"$f":"Ration!H7","v":0},{"$f":"Ration!I7","v":0},{"$f":"Ration!J7","v":0},{"$f":"Ration!L7","v":0},{"$f":"Ration!M7","v":0},{"$f":"Ration!N7","v":0},{"$f":"Ration!O7","v":0},{"$f":"Ration!P7","v":0},{"$f":"'Mischung 1'!C7","v":0},{"$f":"'Mischung 1'!B7","v":""},null,null,null,{"$f":"'Mischung 1'!I7","v":""},{"$f":"'Mischung 1'!J7","v":""},{"$f":"'Mischung 1'!K7","v":""},{"$f":"'Mischung 1'!M7","v":""},{"$f":"'Mischung 1'!N7","v":""},{"$f":"'Mischung 1'!O7","v":""},{"$f":"'Mischung 1'!P7","v":""},{"$f":"'Mischung 1'!Q7","v":""}]
[{"$f":"Ration!D8","v":0},{"$f":"Ration!B8","v":""},null,null,null,{"$f":"Ration!H8","v":0},{"$f":"Ration!I8","v":0},{"$f":"Ration!J8","v":0},{"$f":"Ration!L8","v":0},{"$f":"Ration!M8","v":0},{"$f":"Ration!N8","v":0},{"$f":"Ration!O8","v":0},{"$f":"Ration!P8","v":0},{"$f":"'Mischung 1'!C8","v":0},{"$f":"'Mischung 1'!B8","v":""},null,null,null,{"$f":"'Mischung 1'!I8","v":""},{"$f":"'Mischung 1'!J8","v":""},{"$f":"'Mischung 1'!K8","v":""},{"$f":"'Mischung 1'!M8","v":""},{"$f":"'Mischung 1'!N8","v":""},{"$f":"'Mischung 1'!O8","v":""},{"$f":"'Mischung 1'!P8","v":""},{"$f":"'Mischung 1'!Q8","v":""}]
[{"$f":"Ration!D9","v":0},{"$f":"Ration!B9","v":""},null,null,null,{"$f":"Ration!H9","v":0},{"$f":"Ration!I9","v":0},{"$f":"Ration!J9","v":0},{"$f":"Ration!L9","v":0},{"$f":"Ration!M9","v":0},{"$f":"Ration!N9","v":0},{"$f":"Ration!O9","v":0},{"$f":"Ration!P9","v":0},{"$f":"'Mischung 1'!C9","v":0},{"$f":"'Mischung 1'!B9","v":""},null,null,null,{"$f":"'Mischung 1'!I9","v":""},{"$f":"'Mischung 1'!J9","v":""},{"$f":"'Mischung 1'!K9","v":""},{"$f":"'Mischung 1'!M9","v":""},{"$f":"'Mischung 1'!N9","v":""},{"$f":"'Mischung 1'!O9","v":""},{"$f":"'Mischung 1'!P9","v":""},{"$f":"'Mischung 1'!Q9","v":""}]
[{"$f":"Ration!D10","v":0},{"$f":"Ration!B10","v":""},null,null,null,{"$f":"Ration!H10","v":0},{"$f":"Ration!I10","v":0},{"$f":"Ration!J10","v":0},{"$f":"Ration!L10","v":0},{"$f":"Ration!M10","v":0},{"$f":"Ration!N10","v":0},{"$f":"Ration!O10","v":0},{"$f":"Ration!P10","v":0},{"$f":"'Mischung 1'!C10","v":0},{"$f":"'Mischung 1'!B10","v":""},null,null,null,{"$f":"'Mischung 1'!I10","v":""},{"$f":"'Mischung 1'!J10","v":""},{"$f":"'Mischung 1'!K10","v":""},{"$f":"'Mischung 1'!M10","v":""},{"$f":"'Mischung 1'!N10","v":""},{"$f":"'Mischung 1'!O10","v":""},{"$f":"'Mischung 1'!P10","v":""},{"$f":"'Mischung 1'!Q10","v":""}]
[{"$f":"Ration!D11","v":0},{"$f":"Ration!B11","v":""},null,null,null,{"$f":"Ration!H11","v":0},{"$f":"Ration!I11","v":0},{"$f":"Ration!J11","v":0},{"$f":"Ration!L11","v":0},{"$f":"Ration!M11","v":0},{"$f":"Ration!N11","v":0},{"$f":"Ration!O11","v":0},{"$f":"Ration!P11","v":0},{"$f":"'Mischung 1'!C11","v":0},{"$f":"'Mischung 1'!B11","v":""},null,null,null,{"$f":"'Mischung 1'!I11","v":""},{"$f":"'Mischung 1'!J11","v":""},{"$f":"'Mischung 1'!K11","v":""},{"$f":"'Mischung 1'!M11","v":""},{"$f":"'Mischung 1'!N11","v":""},{"$f":"'Mischung 1'!O11","v":""},{"$f":"'Mischung 1'!P11","v":""},{"$f":"'Mischung 1'!Q11","v":""}]
[{"$f":"Ration!D12","v":0},{"$f":"Ration!B12","v":""},null,null,null,{"$f":"Ration!H12","v":0},{"$f":"Ration!I12","v":0},{"$f":"Ration!J12","v":0},{"$f":"Ration!L12","v":0},{"$f":"Ration!M12","v":0},{"$f":"Ration!N12","v":0},{"$f":"Ration!O12","v":0},{"$f":"Ration!P12","v":0},{"$f":"'Mischung 1'!C12","v":0},{"$f":"'Mischung 1'!B12","v":""},null,null,null,{"$f":"'Mischung 1'!I12","v":""},{"$f":"'Mischung 1'!J12","v":""},{"$f":"'Mischung 1'!K12","v":""},{"$f":"'Mischung 1'!M12","v":""},{"$f":"'Mischung 1'!N12","v":""},{"$f":"'Mischung 1'!O12","v":""},{"$f":"'Mischung 1'!P12","v":""},{"$f":"'Mischung 1'!Q12","v":""}]
{"$rows_left_out":17}