{"text_format":"1","workbook":"xlsx","n_sheets":8,"sheets":["Einstellung","Sollwerte","Ration","Mischung 1","Mischung 2","Gruber Tabelle","Mengenberechnung","Ausdruck"],"not_rendered":{"charts":0,"images":28,"macros":1,"external_links":0,"defined_names":4,"comments":2,"pivot_tables":0},"unopened":[],"bounds":{"document_bytes":16777216,"sheet_cells":100000,"rows_first":2000,"rows_last":500,"rows_between":2000,"halvings":0,"cell_chars":16384,"cell_head_chars":4096},"cells_cut":0,"cells_raw":0,"read":"whole","date_system":"1900"}

{"sheet":"Einstellung","index":0,"n_rows":17,"n_cols":6,"rows_kept":17,"cut":false,"hidden":false,"merged":[[2,1,3,4],[14,1,14,4],[8,1,9,4],[24,1,24,12],[4,3,4,4],[4,1,4,2],[5,1,5,4],[1,1,1,16],[15,1,15,4],[16,1,16,4],[4,5,23,16],[6,2,6,4],[7,1,7,4],[10,1,10,4],[11,1,11,4],[12,1,12,4],[13,1,13,4],[2,5,2,16],[3,5,3,16]]}
[]
[]
[null,"Adressfelder bitte bearbeiten. Diese sind zur Dokumentation von Futtermischungen nötig.",null,null,null,"Futterberechnung zur Fütterung in der Rindermast"]
[null,null,null,null,null,"Gruber Tabelle, 28. Auflage / Januar 2024        www.LfL.bayern.de"]
[null,"Tierhaltungsschule",null,"Triesdorf"]
[null,"Markgrafenstraße 12"]
{"$rows_left_out":12}
{"sheet":"Sollwerte","index":1,"n_rows":80,"n_cols":23,"rows_kept":80,"cut":false,"hidden":false,"merged":[[1,1,2,13],[0,1,0,13],[1,16,2,22]]}
[]
[null,"Richtwerte zur Futteraufnahme (TM-Tag) , Empfehlungen zur Energieversorgung (MJ ME) und Rohproteinversorgung (CP) pro Tag",null,null,null,null,null,null,null,null,null,null,null,null,null,null,"Spurenelemente mg / kg TM"]
[]
[null,"Tiere zur Mast","Kenn - Nr.","TM g","aNDF %","CP g","CP/kg TM","ME/MJ","ME/kgTM"," Ca g","P g","Mg g","Na g","K g","LM","Faktor","Fe","Cu","Zn","Mn","Co","J","Se"]
[null,"    Bitte Sollwerte auswählen !",0,0,null,0,null,0,null,0,0,0,0,0,null,"zur Ber. v. pabKH u. NDF","mg","mg","mg","mg","mg","mg","mg"]
[null,"Fresserfütterung  LM 100  - mittl. ZN 1000 g  ",1,1700,25,264,152,20.399999999999999,11.77,16.600000000000001,7.7,3,2.5,17.5,100,{"$f":"IF(O6>0,700^0.62/O6^0.62,0)","v":3.3416486480802288},50,10,50,50,0.2,0.5,0.2]
{"$rows_left_out":75}
{"sheet":"Ration","index":2,"n_rows":37,"n_cols":28,"rows_kept":37,"cut":false,"hidden":false,"merged":[[1,21,1,27],[31,0,32,2],[24,0,24,2],[30,0,30,2],[28,0,28,2],[3,5,12,5],[27,21,27,27],[25,0,25,3],[26,0,26,3],[27,0,27,3],[1,10,1,17]]}
[]
[1,null,null,null,null,null,null,null,null,null,{"$f":"INDEX(Sollwerte!B5:B80,Ration!A2)","v":"    Bitte Sollwerte auswählen !"},{"$f":"INDEX(Sollwerte!H6:H80,Ration!G2)","v":{"$error":"#VALUE!"}},{"$f":"INDEX(Sollwerte!I6:I80,Ration!H2)","v":{"$error":"#VALUE!"}},{"$f":"INDEX(Sollwerte!J6:J80,Ration!I2)","v":{"$error":"#VALUE!"}},{"$f":"INDEX(Sollwerte!K6:K80,Ration!J2)","v":{"$error":"#VALUE!"}},{"$f":"INDEX(Sollwerte!L6:L80,Ration!K2)","v":{"$error":"#VALUE!"}},{"$f":"INDEX(Sollwerte!M6:M80,Ration!L2)","v":{"$error":"#VALUE!"}},{"$f":"INDEX(Sollwerte!N6:N80,Ration!M2)","v":{"$error":"#VALUE!"}},null,null,null,"Spurenelemente in mg / kg TM"]
["Nr ","Futterart","TM %","TM g","FM kg Ration",null,null,"aNDF om g","CP g","nXP g","ME MJ","ST+ZU g","bST g","CL g","Ca g","P g","Mg g","Na g","K g","Preis / dt FM","Typ","Fe","Cu","Zn","Mn","Co","J","Se"]
[null,{"$f":"IFERROR(VLOOKUP(A4,'Gruber Tabelle'!$A$6:$V$354,2,0),0)","v":0},{"$f":"IFERROR(VLOOKUP(A4,'Gruber Tabelle'!$A$6:$V$354,3,0)/1000,0)","v":0},{"$f":"IFERROR(VLOOKUP(A4,'Gruber Tabelle'!$A$6:$V$354,3,0),0)","v":0},{"$f":"IFERROR(F15/C15,0)","v":0},"in 1000 g Trockenmasse",null,{"$f":"IFERROR(VLOOKUP(A4,'Gruber Tabelle'!$A$6:$V$354,5,0),0)","v":0},{"$f":"IFERROR(VLOOKUP(A4,'Gruber Tabelle'!$A$6:$V$354,7,0),0)","v":0},{"$f":"IFERROR(VLOOKUP(A4,'Gruber Tabelle'!$A$6:$V$354,8,0),0)","v":0},{"$f":"IFERROR(VLOOKUP(A4,'Gruber Tabelle'!$A$6:$V$354,12,0),0)","v":0},{"$f":"IFERROR(VLOOKUP(A4,'Gruber Tabelle'!$A$6:$V$354,13,0),0)","v":0},{"$f":"IFERROR(VLOOKUP(A4,'Gruber Tabelle'!$A$6:$V$354,14,0),0)","v":0},{"$f":"IFERROR(VLOOKUP(A4,'Gruber Tabelle'!$A$6:$V$354,15,0),0)","v":0},{"$f":"IFERROR(VLOOKUP(A4,'Gruber Tabelle'!$A$6:$V$354,16,0),0)","v":0},{"$f":"IFERROR(VLOOKUP(A4,'Gruber Tabelle'!$A$6:$V$354,17,0),0)","v":0},{"$f":"IFERROR(VLOOKUP(A4,'Gruber Tabelle'!$A$6:$V$354,18,0),0)","v":0},{"$f":"IFERROR(VLOOKUP(A4,'Gruber Tabelle'!$A$6:$V$354,19,0),0)","v":0},{"$f":"IFERROR(VLOOKUP(A4,'Gruber Tabelle'!$A$6:$V$354,20,0),0)","v":0},{"$f":"IFERROR(VLOOKUP(A4,'Gruber Tabelle'!$A$6:$V$354,21,0),0)","v":0},{"$f":"IFERROR(VLOOKUP(A4,'Gruber Tabelle'!$A$6:$V$354,22,0),0)","v":0},{"$f":"IFERROR(VLOOKUP(A4,'Gruber Tabelle'!$A$6:$AC$354,23,0),0)","v":0},{"$f":"IFERROR(VLOOKUP(A4,'Gruber Tabelle'!$A$6:$AC$354,24,0),0)","v":0},{"$f":"IFERROR(VLOOKUP(A4,'Gruber Tabelle'!$A$6:$AC$354,25,0),0)","v":0},{"$f":"IFERROR(VLOOKUP(A4,'Gruber Tabelle'!$A$6:$AC$354,26,0),0)","v":0},{"$f":"IFERROR(VLOOKUP(A4,'Gruber Tabelle'!$A$6:$AC$354,27,0),0)","v":0},{"$f":"IFERROR(VLOOKUP(A4,'Gruber Tabelle'!$A$6:$AC$354,28,0),0)","v":0},{"$f":"IFERROR(VLOOKUP(A4,'Gruber Tabelle'!$A$6:$AC$354,29,0),0)","v":0}]
[null,{"$f":"IFERROR(VLOOKUP(A5,'Gruber Tabelle'!$A$6:$V$354,2,0),0)","v":0},{"$f":"IFERROR(VLOOKUP(A5,'Gruber Tabelle'!$A$6:$V$354,3,0)/1000,0)","v":0},{"$f":"IFERROR(VLOOKUP(A5,'Gruber Tabelle'!$A$6:$V$354,3,0),0)","v":0},0,null,null,{"$f":"IFERROR(VLOOKUP(A5,'Gruber Tabelle'!$A$6:$V$354,5,0),0)","v":0},{"$f":"IFERROR(VLOOKUP(A5,'Gruber Tabelle'!$A$6:$V$354,7,0),0)","v":0},{"$f":"IFERROR(VLOOKUP(A5,'Gruber Tabelle'!$A$6:$V$354,8,0),0)","v":0},{"$f":"IFERROR(VLOOKUP(A5,'Gruber Tabelle'!$A$6:$V$354,12,0),0)","v":0},{"$f":"IFERROR(VLOOKUP(A5,'Gruber Tabelle'!$A$6:$V$354,13,0),0)","v":0},{"$f":"IFERROR(VLOOKUP(A5,'Gruber Tabelle'!$A$6:$V$354,14,0),0)","v":0},{"$f":"IFERROR(VLOOKUP(A5,'Gruber Tabelle'!$A$6:$V$354,15,0),0)","v":0},{"$f":"IFERROR(VLOOKUP(A5,'Gruber Tabelle'!$A$6:$V$354,16,0),0)","v":0},{"$f":"IFERROR(VLOOKUP(A5,'Gruber Tabelle'!$A$6:$V$354,17,0),0)","v":0},{"$f":"IFERROR(VLOOKUP(A5,'Gruber Tabelle'!$A$6:$V$354,18,0),0)","v":0},{"$f":"IFERROR(VLOOKUP(A5,'Gruber Tabelle'!$A$6:$V$354,19,0),0)","v":0},{"$f":"IFERROR(VLOOKUP(A5,'Gruber Tabelle'!$A$6:$V$354,20,0),0)","v":0},{"$f":"IFERROR(VLOOKUP(A5,'Gruber Tabelle'!$A$6:$V$354,21,0),0)","v":0},{"$f":"IFERROR(VLOOKUP(A5,'Gruber Tabelle'!$A$6:$V$354,22,0),0)","v":0},{"$f":"IFERROR(VLOOKUP(A5,'Gruber Tabelle'!$A$6:$AC$354,23,0),0)","v":0},{"$f":"IFERROR(VLOOKUP(A5,'Gruber Tabelle'!$A$6:$AC$354,24,0),0)","v":0},{"$f":"IFERROR(VLOOKUP(A5,'Gruber Tabelle'!$A$6:$AC$354,25,0),0)","v":0},{"$f":"IFERROR(VLOOKUP(A5,'Gruber Tabelle'!$A$6:$AC$354,26,0),0)","v":0},{"$f":"IFERROR(VLOOKUP(A5,'Gruber Tabelle'!$A$6:$AC$354,27,0),0)","v":0},{"$f":"IFERROR(VLOOKUP(A5,'Gruber Tabelle'!$A$6:$AC$354,28,0),0)","v":0},{"$f":"IFERROR(VLOOKUP(A5,'Gruber Tabelle'!$A$6:$AC$354,29,0),0)","v":0}]
[null,{"$f":"IFERROR(VLOOKUP(A6,'Gruber Tabelle'!$A$6:$V$354,2,0),0)","v":0},{"$f":"IFERROR(VLOOKUP(A6,'Gruber Tabelle'!$A$6:$V$354,3,0)/1000,0)","v":0},{"$f":"IFERROR(VLOOKUP(A6,'Gruber Tabelle'!$A$6:$V$354,3,0),0)","v":0},0,null,null,{"$f":"IFERROR(VLOOKUP(A6,'Gruber Tabelle'!$A$6:$V$354,5,0),0)","v":0},{"$f":"IFERROR(VLOOKUP(A6,'Gruber Tabelle'!$A$6:$V$354,7,0),0)","v":0},{"$f":"IFERROR(VLOOKUP(A6,'Gruber Tabelle'!$A$6:$V$354,8,0),0)","v":0},{"$f":"IFERROR(VLOOKUP(A6,'Gruber Tabelle'!$A$6:$V$354,12,0),0)","v":0},{"$f":"IFERROR(VLOOKUP(A6,'Gruber Tabelle'!$A$6:$V$354,13,0),0)","v":0},{"$f":"IFERROR(VLOOKUP(A6,'Gruber Tabelle'!$A$6:$V$354,14,0),0)","v":0},{"$f":"IFERROR(VLOOKUP(A6,'Gruber Tabelle'!$A$6:$V$354,15,0),0)","v":0},{"$f":"IFERROR(VLOOKUP(A6,'Gruber Tabelle'!$A$6:$V$354,16,0),0)","v":0},{"$f":"IFERROR(VLOOKUP(A6,'Gruber Tabelle'!$A$6:$V$354,17,0),0)","v":0},{"$f":"IFERROR(VLOOKUP(A6,'Gruber Tabelle'!$A$6:$V$354,18,0),0)","v":0},{"$f":"IFERROR(VLOOKUP(A6,'Gruber Tabelle'!$A$6:$V$354,19,0),0)","v":0},{"$f":"IFERROR(VLOOKUP(A6,'Gruber Tabelle'!$A$6:$V$354,20,0),0)","v":0},{"$f":"IFERROR(VLOOKUP(A6,'Gruber Tabelle'!$A$6:$V$354,21,0),0)","v":0},{"$f":"IFERROR(VLOOKUP(A6,'Gruber Tabelle'!$A$6:$V$354,22,0),0)","v":0},{"$f":"IFERROR(VLOOKUP(A6,'Gruber Tabelle'!$A$6:$AC$354,23,0),0)","v":0},{"$f":"IFERROR(VLOOKUP(A6,'Gruber Tabelle'!$A$6:$AC$354,24,0),0)","v":0},{"$f":"IFERROR(VLOOKUP(A6,'Gruber Tabelle'!$A$6:$AC$354,25,0),0)","v":0},{"$f":"IFERROR(VLOOKUP(A6,'Gruber Tabelle'!$A$6:$AC$354,26,0),0)","v":0},{"$f":"IFERROR(VLOOKUP(A6,'Gruber Tabelle'!$A$6:$AC$354,27,0),0)","v":0},{"$f":"IFERROR(VLOOKUP(A6,'Gruber Tabelle'!$A$6:$AC$354,28,0),0)","v":0},{"$f":"IFERROR(VLOOKUP(A6,'Gruber Tabelle'!$A$6:$AC$354,29,0),0)","v":0}]
{"$rows_left_out":32}
{"sheet":"Mischung 1","index":3,"n_rows":26,"n_cols":26,"rows_kept":26,"cut":false,"hidden":false,"merged":[[25,0,25,25],[0,19,0,25],[24,0,24,1],[0,0,0,18],[1,0,1,5],[1,6,1,18],[2,2,12,5]]}
[null,null,null,null,null,null,null,null,null,null,null,null,null,null,null,null,null,null,null,"Spurenelemente  mg / kg TS"]
[]
["Nr ","Futterart",null,null,null,null,"aNDFom g","CP g","nXP g","ME MJ","ST+ZU g","bST g","CL g","Ca g","P g","Mg g","Na g","K g","Preis / dt FM","Fe","Cu","Zn","Mn","Co","J","Se"]
[null,{"$f":"IFERROR(VLOOKUP(A4,'Gruber Tabelle'!$A$6:$V$354,2,0),0)","v":0},null,null,null,null,{"$f":"IFERROR(VLOOKUP(A4,'Gruber Tabelle'!$A$6:$V$354,5,0),0)","v":0},{"$f":"IFERROR(VLOOKUP(A4,'Gruber Tabelle'!$A$6:$V$354,7,0),0)","v":0},{"$f":"IFERROR(VLOOKUP(A4,'Gruber Tabelle'!$A$6:$V$354,8,0),0)","v":0},{"$f":"IFERROR(VLOOKUP(A4,'Gruber Tabelle'!$A$6:$V$354,12,0),0)","v":0},{"$f":"IFERROR(VLOOKUP(A4,'Gruber Tabelle'!$A$6:$V$354,13,0),0)","v":0},{"$f":"IFERROR(VLOOKUP(A4,'Gruber Tabelle'!$A$6:$V$354,14,0),0)","v":0},{"$f":"IFERROR(VLOOKUP(A4,'Gruber Tabelle'!$A$6:$V$354,15,0),0)","v":0},{"$f":"IFERROR(VLOOKUP(A4,'Gruber Tabelle'!$A$6:$V$354,16,0),0)","v":0},{"$f":"IFERROR(VLOOKUP(A4,'Gruber Tabelle'!$A$6:$V$354,17,0),0)","v":0},{"$f":"IFERROR(VLOOKUP(A4,'Gruber Tabelle'!$A$6:$V$354,18,0),0)","v":0},{"$f":"IFERROR(VLOOKUP(A4,'Gruber Tabelle'!$A$6:$V$354,19,0),0)","v":0},{"$f":"IFERROR(VLOOKUP(A4,'Gruber Tabelle'!$A$6:$V$354,20,0),0)","v":0},{"$f":"IFERROR(VLOOKUP(A4,'Gruber Tabelle'!$A$6:$V$354,21,0),0)","v":0},{"$f":"IFERROR(VLOOKUP(A4,'Gruber Tabelle'!$A$6:$AC$354,23,0),0)","v":0},{"$f":"IFERROR(VLOOKUP(A4,'Gruber Tabelle'!$A$6:$AC$354,24,0),0)","v":0},{"$f":"IFERROR(VLOOKUP(A4,'Gruber Tabelle'!$A$6:$AC$354,25,0),0)","v":0},{"$f":"IFERROR(VLOOKUP(A4,'Gruber Tabelle'!$A$6:$AC$354,26,0),0)","v":0},{"$f":"IFERROR(VLOOKUP(A4,'Gruber Tabelle'!$A$6:$AC$354,27,0),0)","v":0},{"$f":"IFERROR(VLOOKUP(A4,'Gruber Tabelle'!$A$6:$AC$354,28,0),0)","v":0},{"$f":"IFERROR(VLOOKUP(A4,'Gruber Tabelle'!$A$6:$AC$354,29,0),0)","v":0}]
[null,{"$f":"IFERROR(VLOOKUP(A5,'Gruber Tabelle'!$A$6:$V$354,2,0),0)","v":0},null,null,null,null,{"$f":"IFERROR(VLOOKUP(A5,'Gruber Tabelle'!$A$6:$V$354,5,0),0)","v":0},{"$f":"IFERROR(VLOOKUP(A5,'Gruber Tabelle'!$A$6:$V$354,7,0),0)","v":0},{"$f":"IFERROR(VLOOKUP(A5,'Gruber Tabelle'!$A$6:$V$354,8,0),0)","v":0},{"$f":"IFERROR(VLOOKUP(A5,'Gruber Tabelle'!$A$6:$V$354,12,0),0)","v":0},{"$f":"IFERROR(VLOOKUP(A5,'Gruber Tabelle'!$A$6:$V$354,13,0),0)","v":0},{"$f":"IFERROR(VLOOKUP(A5,'Gruber Tabelle'!$A$6:$V$354,14,0),0)","v":0},{"$f":"IFERROR(VLOOKUP(A5,'Gruber Tabelle'!$A$6:$V$354,15,0),0)","v":0},{"$f":"IFERROR(VLOOKUP(A5,'Gruber Tabelle'!$A$6:$V$354,16,0),0)","v":0},{"$f":"IFERROR(VLOOKUP(A5,'Gruber Tabelle'!$A$6:$V$354,17,0),0)","v":0},{"$f":"IFERROR(VLOOKUP(A5,'Gruber Tabelle'!$A$6:$V$354,18,0),0)","v":0},{"$f":"IFERROR(VLOOKUP(A5,'Gruber Tabelle'!$A$6:$V$354,19,0),0)","v":0},{"$f":"IFERROR(VLOOKUP(A5,'Gruber Tabelle'!$A$6:$V$354,20,0),0)","v":0},{"$f":"IFERROR(VLOOKUP(A5,'Gruber Tabelle'!$A$6:$V$354,21,0),0)","v":0},{"$f":"IFERROR(VLOOKUP(A5,'Gruber Tabelle'!$A$6:$AC$354,23,0),0)","v":0},{"$f":"IFERROR(VLOOKUP(A5,'Gruber Tabelle'!$A$6:$AC$354,24,0),0)","v":0},{"$f":"IFERROR(VLOOKUP(A5,'Gruber Tabelle'!$A$6:$AC$354,25,0),0)","v":0},{"$f":"IFERROR(VLOOKUP(A5,'Gruber Tabelle'!$A$6:$AC$354,26,0),0)","v":0},{"$f":"IFERROR(VLOOKUP(A5,'Gruber Tabelle'!$A$6:$AC$354,27,0),0)","v":0},{"$f":"IFERROR(VLOOKUP(A5,'Gruber Tabelle'!$A$6:$AC$354,28,0),0)","v":0},{"$f":"IFERROR(VLOOKUP(A5,'Gruber Tabelle'!$A$6:$AC$354,29,0),0)","v":0}]
[null,{"$f":"IFERROR(VLOOKUP(A6,'Gruber Tabelle'!$A$6:$V$354,2,0),0)","v":0},null,null,null,null,{"$f":"IFERROR(VLOOKUP(A6,'Gruber Tabelle'!$A$6:$V$354,5,0),0)","v":0},{"$f":"IFERROR(VLOOKUP(A6,'Gruber Tabelle'!$A$6:$V$354,7,0),0)","v":0},{"$f":"IFERROR(VLOOKUP(A6,'Gruber Tabelle'!$A$6:$V$354,8,0),0)","v":0},{"$f":"IFERROR(VLOOKUP(A6,'Gruber Tabelle'!$A$6:$V$354,12,0),0)","v":0},{"$f":"IFERROR(VLOOKUP(A6,'Gruber Tabelle'!$A$6:$V$354,13,0),0)","v":0},{"$f":"IFERROR(VLOOKUP(A6,'Gruber Tabelle'!$A$6:$V$354,14,0),0)","v":0},{"$f":"IFERROR(VLOOKUP(A6,'Gruber Tabelle'!$A$6:$V$354,15,0),0)","v":0},{"$f":"IFERROR(VLOOKUP(A6,'Gruber Tabelle'!$A$6:$V$354,16,0),0)","v":0},{"$f":"IFERROR(VLOOKUP(A6,'Gruber Tabelle'!$A$6:$V$354,17,0),0)","v":0},{"$f":"IFERROR(VLOOKUP(A6,'Gruber Tabelle'!$A$6:$V$354,18,0),0)","v":0},{"$f":"IFERROR(VLOOKUP(A6,'Gruber Tabelle'!$A$6:$V$354,19,0),0)","v":0},{"$f":"IFERROR(VLOOKUP(A6,'Gruber Tabelle'!$A$6:$V$354,20,0),0)","v":0},{"$f":"IFERROR(VLOOKUP(A6,'Gruber Tabelle'!$A$6:$V$354,21,0),0)","v":0},{"$f":"IFERROR(VLOOKUP(A6,'Gruber Tabelle'!$A$6:$AC$354,23,0),0)","v":0},{"$f":"IFERROR(VLOOKUP(A6,'Gruber Tabelle'!$A$6:$AC$354,24,0),0)","v":0},{"$f":"IFERROR(VLOOKUP(A6,'Gruber Tabelle'!$A$6:$AC$354,25,0),0)","v":0},{"$f":"IFERROR(VLOOKUP(A6,'Gruber Tabelle'!$A$6:$AC$354,26,0),0)","v":0},{"$f":"IFERROR(VLOOKUP(A6,'Gruber Tabelle'!$A$6:$AC$354,27,0),0)","v":0},{"$f":"IFERROR(VLOOKUP(A6,'Gruber Tabelle'!$A$6:$AC$354,28,0),0)","v":0},{"$f":"IFERROR(VLOOKUP(A6,'Gruber Tabelle'!$A$6:$AC$354,29,0),0)","v":0}]
{"$rows_left_out":21}
{"sheet":"Mischung 2","index":4,"n_rows":26,"n_cols":26,"rows_kept":26,"cut":false,"hidden":false,"merged":[[25,0,25,25],[0,19,0,25],[24,0,24,1],[0,0,0,18],[1,0,1,4],[1,6,1,18],[2,2,12,5]]}
[null,null,null,null,null,null,null,null,null,null,null,null,null,null,null,null,null,null,null,"Spurenelemente  mg / kg TM"]
[]
["Nr ","Futterart",null,null,null,null,"aNDFom g","CP g","nXP g","ME Mj","ST+ZU","bST","CL g","Ca","P","Mg","Na","K","Preis / dt FM","Fe","Cu","Zn","Mn","Co","J","Se"]
[null,{"$f":"IFERROR(VLOOKUP(A4,'Gruber Tabelle'!$A$6:$V$354,2,0),0)","v":0},null,null,null,null,{"$f":"IFERROR(VLOOKUP(A4,'Gruber Tabelle'!$A$6:$V$354,5,0),0)","v":0},{"$f":"IFERROR(VLOOKUP(A4,'Gruber Tabelle'!$A$6:$V$354,7,0),0)","v":0},{"$f":"IFERROR(VLOOKUP(A4,'Gruber Tabelle'!$A$6:$V$354,8,0),0)","v":0},{"$f":"IFERROR(VLOOKUP(A4,'Gruber Tabelle'!$A$6:$V$354,12,0),0)","v":0},{"$f":"IFERROR(VLOOKUP(A4,'Gruber Tabelle'!$A$6:$V$354,13,0),0)","v":0},{"$f":"IFERROR(VLOOKUP(A4,'Gruber Tabelle'!$A$6:$V$354,14,0),0)","v":0},{"$f":"IFERROR(VLOOKUP(A4,'Gruber Tabelle'!$A$6:$V$354,15,0),0)","v":0},{"$f":"IFERROR(VLOOKUP(A4,'Gruber Tabelle'!$A$6:$V$354,16,0),0)","v":0},{"$f":"IFERROR(VLOOKUP(A4,'Gruber Tabelle'!$A$6:$V$354,17,0),0)","v":0},{"$f":"IFERROR(VLOOKUP(A4,'Gruber Tabelle'!$A$6:$V$354,18,0),0)","v":0},{"$f":"IFERROR(VLOOKUP(A4,'Gruber Tabelle'!$A$6:$V$354,19,0),0)","v":0},{"$f":"IFERROR(VLOOKUP(A4,'Gruber Tabelle'!$A$6:$V$354,20,0),0)","v":0},{"$f":"IFERROR(VLOOKUP(A4,'Gruber Tabelle'!$A$6:$V$354,21,0),0)","v":0},{"$f":"IFERROR(VLOOKUP(A4,'Gruber Tabelle'!$A$6:$AC$354,23,0),0)","v":0},{"$f":"IFERROR(VLOOKUP(A4,'Gruber Tabelle'!$A$6:$AC$354,24,0),0)","v":0},{"$f":"IFERROR(VLOOKUP(A4,'Gruber Tabelle'!$A$6:$AC$354,25,0),0)","v":0},{"$f":"IFERROR(VLOOKUP(A4,'Gruber Tabelle'!$A$6:$AC$354,26,0),0)","v":0},{"$f":"IFERROR(VLOOKUP(A4,'Gruber Tabelle'!$A$6:$AC$354,27,0),0)","v":0},{"$f":"IFERROR(VLOOKUP(A4,'Gruber Tabelle'!$A$6:$AC$354,28,0),0)","v":0},{"$f":"IFERROR(VLOOKUP(A4,'Gruber Tabelle'!$A$6:$AC$354,29,0),0)","v":0}]
[null,{"$f":"IFERROR(VLOOKUP(A5,'Gruber Tabelle'!$A$6:$V$354,2,0),0)","v":0},null,null,null,null,{"$f":"IFERROR(VLOOKUP(A5,'Gruber Tabelle'!$A$6:$V$354,5,0),0)","v":0},{"$f":"IFERROR(VLOOKUP(A5,'Gruber Tabelle'!$A$6:$V$354,7,0),0)","v":0},{"$f":"IFERROR(VLOOKUP(A5,'Gruber Tabelle'!$A$6:$V$354,8,0),0)","v":0},{"$f":"IFERROR(VLOOKUP(A5,'Gruber Tabelle'!$A$6:$V$354,12,0),0)","v":0},{"$f":"IFERROR(VLOOKUP(A5,'Gruber Tabelle'!$A$6:$V$354,13,0),0)","v":0},{"$f":"IFERROR(VLOOKUP(A5,'Gruber Tabelle'!$A$6:$V$354,14,0),0)","v":0},{"$f":"IFERROR(VLOOKUP(A5,'Gruber Tabelle'!$A$6:$V$354,15,0),0)","v":0},{"$f":"IFERROR(VLOOKUP(A5,'Gruber Tabelle'!$A$6:$V$354,16,0),0)","v":0},{"$f":"IFERROR(VLOOKUP(A5,'Gruber Tabelle'!$A$6:$V$354,17,0),0)","v":0},{"$f":"IFERROR(VLOOKUP(A5,'Gruber Tabelle'!$A$6:$V$354,18,0),0)","v":0},{"$f":"IFERROR(VLOOKUP(A5,'Gruber Tabelle'!$A$6:$V$354,19,0),0)","v":0},{"$f":"IFERROR(VLOOKUP(A5,'Gruber Tabelle'!$A$6:$V$354,20,0),0)","v":0},{"$f":"IFERROR(VLOOKUP(A5,'Gruber Tabelle'!$A$6:$V$354,21,0),0)","v":0},{"$f":"IFERROR(VLOOKUP(A5,'Gruber Tabelle'!$A$6:$AC$354,23,0),0)","v":0},{"$f":"IFERROR(VLOOKUP(A5,'Gruber Tabelle'!$A$6:$AC$354,24,0),0)","v":0},{"$f":"IFERROR(VLOOKUP(A5,'Gruber Tabelle'!$A$6:$AC$354,25,0),0)","v":0},{"$f":"IFERROR(VLOOKUP(A5,'Gruber Tabelle'!$A$6:$AC$354,26,0),0)","v":0},{"$f":"IFERROR(VLOOKUP(A5,'Gruber Tabelle'!$A$6:$AC$354,27,0),0)","v":0},{"$f":"IFERROR(VLOOKUP(A5,'Gruber Tabelle'!$A$6:$AC$354,28,0),0)","v":0},{"$f":"IFERROR(VLOOKUP(A5,'Gruber Tabelle'!$A$6:$AC$354,29,0),0)","v":0}]
[null,{"$f":"IFERROR(VLOOKUP(A6,'Gruber Tabelle'!$A$6:$V$354,2,0),0)","v":0},null,null,null,null,{"$f":"IFERROR(VLOOKUP(A6,'Gruber Tabelle'!$A$6:$V$354,5,0),0)","v":0},{"$f":"IFERROR(VLOOKUP(A6,'Gruber Tabelle'!$A$6:$V$354,7,0),0)","v":0},{"$f":"IFERROR(VLOOKUP(A6,'Gruber Tabelle'!$A$6:$V$354,8,0),0)","v":0},{"$f":"IFERROR(VLOOKUP(A6,'Gruber Tabelle'!$A$6:$V$354,12,0),0)","v":0},{"$f":"IFERROR(VLOOKUP(A6,'Gruber Tabelle'!$A$6:$V$354,13,0),0)","v":0},{"$f":"IFERROR(VLOOKUP(A6,'Gruber Tabelle'!$A$6:$V$354,14,0),0)","v":0},{"$f":"IFERROR(VLOOKUP(A6,'Gruber Tabelle'!$A$6:$V$354,15,0),0)","v":0},{"$f":"IFERROR(VLOOKUP(A6,'Gruber Tabelle'!$A$6:$V$354,16,0),0)","v":0},{"$f":"IFERROR(VLOOKUP(A6,'Gruber Tabelle'!$A$6:$V$354,17,0),0)","v":0},{"$f":"IFERROR(VLOOKUP(A6,'Gruber Tabelle'!$A$6:$V$354,18,0),0)","v":0},{"$f":"IFERROR(VLOOKUP(A6,'Gruber Tabelle'!$A$6:$V$354,19,0),0)","v":0},{"$f":"IFERROR(VLOOKUP(A6,'Gruber Tabelle'!$A$6:$V$354,20,0),0)","v":0},{"$f":"IFERROR(VLOOKUP(A6,'Gruber Tabelle'!$A$6:$V$354,21,0),0)","v":0},{"$f":"IFERROR(VLOOKUP(A6,'Gruber Tabelle'!$A$6:$AC$354,23,0),0)","v":0},{"$f":"IFERROR(VLOOKUP(A6,'Gruber Tabelle'!$A$6:$AC$354,24,0),0)","v":0},{"$f":"IFERROR(VLOOKUP(A6,'Gruber Tabelle'!$A$6:$AC$354,25,0),0)","v":0},{"$f":"IFERROR(VLOOKUP(A6,'Gruber Tabelle'!$A$6:$AC$354,26,0),0)","v":0},{"$f":"IFERROR(VLOOKUP(A6,'Gruber Tabelle'!$A$6:$AC$354,27,0),0)","v":0},{"$f":"IFERROR(VLOOKUP(A6,'Gruber Tabelle'!$A$6:$AC$354,28,0),0)","v":0},{"$f":"IFERROR(VLOOKUP(A6,'Gruber Tabelle'!$A$6:$AC$354,29,0),0)","v":0}]
{"$rows_left_out":21}
{"sheet":"Gruber Tabelle","index":5,"n_rows":353,"n_cols":29,"rows_kept":353,"cut":false,"hidden":false,"merged":[[1,22,1,28],[2,22,2,28],[0,0,0,1],[3,21,4,21],[1,2,1,21],[2,2,2,19]]}
["Ration"]
[null,null,"www.LfL.bayern.de         Gruber Tabelle zur Fütterung in der Rindermast      - Fresser - Mastfärsen - Bullen - Mastkühe - Ochsen"]
[null,null,"in 1000 g Trockenmasse TM",null,null,null,null,null,null,null,null,null,null,null,null,null,null,null,null,null,"Preis","Typ","Spurenelemente mg / kg TM"]
[null,null,"TM","XF","aNDFom","ADFom","CP","nXP","UDP","RNB","NEL","ME","ST+ZU","bST","CL","Ca","P","Mg","Na","K","FM",null,"Fe","Cu","Zn","Mn","Co","J","Se"]
[null,null,"g","g","  g","g","g","g","%","g","MJ","MJ","g","g","g","g","g","g","g","g","€ / dt",null,"mg","mg","mg","mg","mg","mg","mg"]
[null,"10.1 Grünfutter",null,null,null,null,null,null,null,{"$f":"(G6-H6)/6.25","v":0}]
{"$rows_left_out":348}
{"sheet":"Mengenberechnung","index":6,"n_rows":42,"n_cols":8,"rows_kept":42,"cut":false,"hidden":false,"merged":[[0,1,0,7],[1,1,1,5],[2,2,2,4],[2,6,2,7],[3,2,3,4],[3,6,9,7],[4,2,4,4],[5,2,5,4],[6,2,6,4],[7,2,7,4],[8,2,8,4],[9,2,9,4],[10,2,10,4],[10,6,15,7],[11,2,11,4],[12,2,12,4],[13,2,13,4],[15,2,15,4],[17,1,17,5],[18,2,18,4],[18,6,18,7],[19,2,19,4],[20,2,20,4],[21,2,21,4],[21,6,24,7],[22,2,22,4],[23,2,23,4],[24,2,24,4],[34,6,37,7],[35,2,35,4],[36,2,36,4],[37,2,37,4],[25,2,25,4],[25,6,28,7],[26,2,26,4],[27,2,27,4],[28,2,28,4],[30,1,30,5],[31,2,31,4],[31,6,31,7],[32,2,32,4],[33,2,33,4],[34,2,34,4],[38,2,38,4],[38,6,41,7],[39,2,39,4],[40,2,40,4],[41,2,41,4]]}
[]
[null,"Basis – Ration für :",null,null,null,null,10,"Tiere"]
[null,"Kenn Nr.","Futtermittel",null,null,"kg."]
[null,{"$f":"Ration!A15","v":0},{"$f":"Ration!B15","v":0},null,null,{"$f":"IF(Ration!F15>0,$G$2*Ration!E4,0)","v":0},"Gesamtgewicht Grundfutter und Kraftfutter pro Mischung in kg:"]
[null,{"$f":"Ration!A16","v":0},{"$f":"Ration!B16","v":0},null,null,{"$f":"IF(Ration!F16>0,$G$2*Ration!E5,0)","v":0}]
[null,{"$f":"Ration!A17","v":0},{"$f":"Ration!B17","v":0},null,null,{"$f":"IF(Ration!F17>0,$G$2*Ration!E6,0)","v":0}]
{"$rows_left_out":37}
{"sheet":"Ausdruck","index":7,"n_rows":59,"n_cols":18,"rows_kept":59,"cut":false,"hidden":false,"merged":[[58,7,58,14],[58,0,58,2],[45,0,45,2],[45,3,45,5],[51,15,51,17],[50,15,50,17],[49,15,49,17],[48,15,48,17],[58,15,58,17],[54,15,54,17],[54,9,54,14],[53,15,53,17],[52,15,52,17],[56,7,56,8],[57,7,57,8],[47,9,47,14],[57,15,57,17],[56,15,56,17],[55,15,55,17],[51,7,51,8],[52,7,52,8],[53,7,53,8],[54,7,54,8],[55,7,55,8],[47,15,47,17],[47,7,47,8],[48,7,48,8],[49,7,49,8],[50,7,50,8],[48,9,48,14],[49,9,49,14],[50,9,50,14],[51,9,51,14],[52,9,52,14],[53,9,53,14],[55,9,55,14],[56,9,56,14],[57,9,57,14],[58,3,58,5],[42,0,42,1],[43,0,43,1],[18,0,18,1],[19,0,19,1],[24,0,24,17],[29,5,30,17],[40,0,40,1],[40,2,40,3],[31,2,31,3],[32,2,32,3],[33,2,33,3],[34,2,34,3],[49,3,49,5],[50,3,50,5],[51,3,51,5],[52,3,52,5],[53,3,53,5],[54,3,54,5],[55,3,55,5],[56,3,56,5],[57,3,57,5],[47,1,47,2],[48,1,48,2],[49,1,49,2],[50,1,50,2],[51,1,51,2],[52,1,52,2],[53,1,53,2],[54,1,54,2],[55,1,55,2],[56,1,56,2],[57,1,57,2],[42,13,42,17],[1,2,1,4],[0,0,0,17],[1,8,1,10],[1,5,1,7],[1,11,1,17],[21,9,21,10],[21,0,21,1],[21,2,21,3],[21,4,21,5],[21,7,21,8],[38,2,38,3],[45,15,45,17],[37,2,37,3],[39,2,39,3],[37,5,39,17],[48,3,48,5],[47,3,47,5],[35,2,35,3],[27,2,27,3],[28,2,28,3],[29,2,29,3],[30,2,30,3],[26,5,27,9],[26,10,27,11],[43,2,43,5],[43,6,43,17],[45,7,45,14],[26,2,26,3],[31,5,32,17],[33,5,34,17],[35,5,36,17],[36,2,36,3],[42,2,42,5],[42,6,42,10],[42,11,42,12]]}
[]
[null,{"$f":"Einstellung!B5","v":"Tierhaltungsschule"},{"$f":"Einstellung!D5","v":"Triesdorf"},null,null,"Betriebs Nr.",null,null,{"$f":"Einstellung!B8","v":"09 111 111 1111"},null,null,{"$f":"Ration!A31","v":"    Bitte Sollwerte auswählen !"}]
[]
["FM kg","Futterart","TM kg","aNDFom","CP g","ME MJ","Ca g","P g","Mg g","Na g","Kosten","Fe","Cu","Zn","Mn","Co","J","Se"]
[{"$f":"Ration!E4","v":0},{"$f":"Ration!B15","v":0},{"$f":"IF(Ration!F15=\"TM o. FM?\",\" \",Ration!F15)","v":0},{"$f":"Ration!H15","v":0},{"$f":"Ration!I15","v":0},{"$f":"Ration!K15","v":0},{"$f":"Ration!O15","v":0},{"$f":"Ration!P15","v":0},{"$f":"Ration!Q15","v":0},{"$f":"Ration!S15","v":0},{"$f":"Ration!T15","v":0},{"$f":"Ration!V15","v":0},{"$f":"Ration!W15","v":0},{"$f":"Ration!X15","v":0},{"$f":"Ration!Y15","v":0},{"$f":"Ration!Z15","v":0},{"$f":"Ration!AA15","v":0},{"$f":"Ration!AB15","v":0}]
[{"$f":"Ration!E5","v":0},{"$f":"Ration!B16","v":0},{"$f":"IF(Ration!F16=\"TM o. FM?\",\" \",Ration!F16)","v":0},{"$f":"Ration!H16","v":0},{"$f":"Ration!I16","v":0},{"$f":"Ration!K16","v":0},{"$f":"Ration!O16","v":0},{"$f":"Ration!P16","v":0},{"$f":"Ration!Q16","v":0},{"$f":"Ration!S16","v":0},{"$f":"Ration!T16","v":0},{"$f":"Ration!V16","v":0},{"$f":"Ration!W16","v":0},{"$f":"Ration!X16","v":0},{"$f":"Ration!Y16","v":0},{"$f":"Ration!Z16","v":0},{"$f":"Ration!AA16","v":0},{"$f":"Ration!AB16","v":0}]
{"$rows_left_out":53}