{"text_format":"1","workbook":"xlsx","n_sheets":7,"sheets":["Einstellung","Sollwerte","Ration","Mischung 1","Gruber Tabelle","Mengenberechnung","Ausdruck"],"not_rendered":{"charts":0,"images":14,"macros":1,"external_links":0,"defined_names":4,"comments":1,"pivot_tables":0},"unopened":[],"bounds":{"document_bytes":16777216,"sheet_cells":100000,"rows_first":2000,"rows_last":500,"rows_between":2000,"halvings":0,"cell_chars":16384,"cell_head_chars":4096},"cells_cut":0,"cells_raw":0,"read":"whole","date_system":"1900"}

{"sheet":"Einstellung","index":0,"n_rows":17,"n_cols":5,"rows_kept":17,"cut":false,"hidden":false,"merged":[[14,2,14,5],[24,1,24,12],[1,1,1,16],[2,1,2,16],[3,1,3,16],[15,2,15,5],[4,6,23,16],[13,2,13,5],[16,2,16,5],[17,2,23,5],[4,1,23,1],[4,2,4,5],[9,2,9,5],[5,2,5,3],[5,4,5,5],[6,2,6,5],[7,3,7,5],[8,2,8,5],[10,2,10,5],[11,2,11,5],[12,2,12,5]]}
[]
[]
[null,"Futterberechnung zur Fütterung von Geflügel"]
[null,"Gruber Tabelle, 27. Auflage / August 2022        www.LfL.bayern.de"]
[]
[null,null,"Tierhaltungsschule",null,"Triesdorf"]
[null,null,"Markgrafenstraße 1"]
[null,null,91746,"Weidenbach"]
{"$rows_left_out":10}
{"sheet":"Sollwerte","index":1,"n_rows":35,"n_cols":27,"rows_kept":35,"cut":false,"hidden":false,"merged":[[1,21,2,26],[2,2,2,20]]}
[]
[null,null,null,null,null,null,null,null,null,null,null,null,null,null,null,null,null,null,null,null,null,"Relation der Aminosäuren  -  Lysin : xx"]
[null,null,"Sollwerte für die Futterberechnung - Alle Felder können geändert werden. "]
["Tier","K. - Nr.","FM g","ME","XP g","Lys g","Met g","M+C g","Thr","Trp","Val","XF g","XS g","XZ g","XA g","Ca","P","vP g","vPph","Na","Mg","Lys","Met","M+C","Thr","Trp","Val"]
["Bitte Sollwerte auswählen  >>>",0,0,0,0,0,0,0,0,0,0,0,0,0,0,0,0,0,0,0,0,0,0,0,0,0,0]
["Kükenstarter 1. - 4. Lebenswoche",1,null,11.5,185,9.1999999999999993,4.2,7.5,null,null,null,40,500,50,60,10,7,null,null,1.6,null,1,0.46,0.82]
["Küken 4.- 8. Lebenswoche",2,null,11.2,163,7.75,3.56,6.34,null,null,null,40,500,50,60,9,6.5,null,null,1.6,null,1,0.46,0.82]
["Junghennen 10. Lebenswoche",3,null,11.05,194,7.46,3.36,6.09,null,null,null,40,500,50,50,7.4,7.1,null,null,1.6,null,1,0.45,0.82]
{"$rows_left_out":28}
{"sheet":"Ration","index":2,"n_rows":35,"n_cols":26,"rows_kept":35,"cut":false,"hidden":false,"merged":[[0,5,1,25],[0,0,0,4],[1,0,2,4],[3,1,3,4],[4,1,4,4],[5,1,5,4],[6,1,6,4],[7,1,7,4],[8,1,8,4],[9,1,9,4],[34,0,34,4],[27,0,27,1],[32,0,32,4],[32,12,32,13],[10,1,10,4],[11,1,11,4],[12,1,12,4],[30,0,30,4],[33,0,33,4],[24,0,24,1],[13,0,13,1],[29,0,29,4]]}
[]
[]
[null,null,null,null,null,"ME","XP g","Lys g","Met g","M+C g","Thr","Trp","Val","XF g","XS g","XZ g","XA g","Ca","P","vP g","vPph","Na","K","XL g","PFS g","Preis / dt"]
[null,{"$f":"VLOOKUP(A4,'Gruber Tabelle'!A4:X100,2,0)","v":0},null,null,null,{"$f":"VLOOKUP(A4,'Gruber Tabelle'!$A$5:$X$100,4,0)","v":0},{"$f":"VLOOKUP(A4,'Gruber Tabelle'!$A$5:$X$100,5,0)","v":0},{"$f":"VLOOKUP(A4,'Gruber Tabelle'!$A$5:$X$100,6,0)","v":0},{"$f":"VLOOKUP(A4,'Gruber Tabelle'!$A$5:$X$100,7,0)","v":0},{"$f":"VLOOKUP(A4,'Gruber Tabelle'!$A$5:$X$100,8,0)","v":0},{"$f":"VLOOKUP(A4,'Gruber Tabelle'!$A$5:$X$100,9,0)","v":0},{"$f":"VLOOKUP(A4,'Gruber Tabelle'!$A$5:$X$100,10,0)","v":0},{"$f":"VLOOKUP(A4,'Gruber Tabelle'!$A$5:$X$100,11,0)","v":0},{"$f":"VLOOKUP(A4,'Gruber Tabelle'!$A$5:$X$100,12,0)","v":0},{"$f":"VLOOKUP(A4,'Gruber Tabelle'!$A$5:$X$100,13,0)","v":0},{"$f":"VLOOKUP(A4,'Gruber Tabelle'!$A$5:$X$100,14,0)","v":0},{"$f":"VLOOKUP(A4,'Gruber Tabelle'!$A$5:$X$100,15,0)","v":0},{"$f":"VLOOKUP(A4,'Gruber Tabelle'!$A$5:$X$100,16,0)","v":0},{"$f":"VLOOKUP(A4,'Gruber Tabelle'!$A$5:$X$100,17,0)","v":0},{"$f":"VLOOKUP(A4,'Gruber Tabelle'!$A$5:$X$100,18,0)","v":0},{"$f":"VLOOKUP(A4,'Gruber Tabelle'!$A$5:$X$100,19,0)","v":0},{"$f":"VLOOKUP(A4,'Gruber Tabelle'!$A$5:$X$100,20,0)","v":0},{"$f":"VLOOKUP(A4,'Gruber Tabelle'!$A$5:$X$100,21,0)","v":0},{"$f":"VLOOKUP(A4,'Gruber Tabelle'!$A$5:$X$100,22,0)","v":0},{"$f":"VLOOKUP(A4,'Gruber Tabelle'!$A$5:$X$100,23,0)","v":0},{"$f":"VLOOKUP(A4,'Gruber Tabelle'!$A$5:$X$100,24,0)","v":0}]
[null,{"$f":"VLOOKUP(A5,'Gruber Tabelle'!A5:X100,2,0)","v":0},null,null,null,{"$f":"VLOOKUP(A5,'Gruber Tabelle'!$A$5:$X$100,4,0)","v":0},{"$f":"VLOOKUP(A5,'Gruber Tabelle'!$A$5:$X$100,5,0)","v":0},{"$f":"VLOOKUP(A5,'Gruber Tabelle'!$A$5:$X$100,6,0)","v":0},{"$f":"VLOOKUP(A5,'Gruber Tabelle'!$A$5:$X$100,7,0)","v":0},{"$f":"VLOOKUP(A5,'Gruber Tabelle'!$A$5:$X$100,8,0)","v":0},{"$f":"VLOOKUP(A5,'Gruber Tabelle'!$A$5:$X$100,9,0)","v":0},{"$f":"VLOOKUP(A5,'Gruber Tabelle'!$A$5:$X$100,10,0)","v":0},{"$f":"VLOOKUP(A5,'Gruber Tabelle'!$A$5:$X$100,11,0)","v":0},{"$f":"VLOOKUP(A5,'Gruber Tabelle'!$A$5:$X$100,12,0)","v":0},{"$f":"VLOOKUP(A5,'Gruber Tabelle'!$A$5:$X$100,13,0)","v":0},{"$f":"VLOOKUP(A5,'Gruber Tabelle'!$A$5:$X$100,14,0)","v":0},{"$f":"VLOOKUP(A5,'Gruber Tabelle'!$A$5:$X$100,15,0)","v":0},{"$f":"VLOOKUP(A5,'Gruber Tabelle'!$A$5:$X$100,16,0)","v":0},{"$f":"VLOOKUP(A5,'Gruber Tabelle'!$A$5:$X$100,17,0)","v":0},{"$f":"VLOOKUP(A5,'Gruber Tabelle'!$A$5:$X$100,18,0)","v":0},{"$f":"VLOOKUP(A5,'Gruber Tabelle'!$A$5:$X$100,19,0)","v":0},{"$f":"VLOOKUP(A5,'Gruber Tabelle'!$A$5:$X$100,20,0)","v":0},{"$f":"VLOOKUP(A5,'Gruber Tabelle'!$A$5:$X$100,21,0)","v":0},{"$f":"VLOOKUP(A5,'Gruber Tabelle'!$A$5:$X$100,22,0)","v":0},{"$f":"VLOOKUP(A5,'Gruber Tabelle'!$A$5:$X$100,23,0)","v":0},{"$f":"VLOOKUP(A5,'Gruber Tabelle'!$A$5:$X$100,24,0)","v":0}]
[null,{"$f":"VLOOKUP(A6,'Gruber Tabelle'!A5:X100,2,0)","v":0},null,null,null,{"$f":"VLOOKUP(A6,'Gruber Tabelle'!$A$5:$X$100,4,0)","v":0},{"$f":"VLOOKUP(A6,'Gruber Tabelle'!$A$5:$X$100,5,0)","v":0},{"$f":"VLOOKUP(A6,'Gruber Tabelle'!$A$5:$X$100,6,0)","v":0},{"$f":"VLOOKUP(A6,'Gruber Tabelle'!$A$5:$X$100,7,0)","v":0},{"$f":"VLOOKUP(A6,'Gruber Tabelle'!$A$5:$X$100,8,0)","v":0},{"$f":"VLOOKUP(A6,'Gruber Tabelle'!$A$5:$X$100,9,0)","v":0},{"$f":"VLOOKUP(A6,'Gruber Tabelle'!$A$5:$X$100,10,0)","v":0},{"$f":"VLOOKUP(A6,'Gruber Tabelle'!$A$5:$X$100,11,0)","v":0},{"$f":"VLOOKUP(A6,'Gruber Tabelle'!$A$5:$X$100,12,0)","v":0},{"$f":"VLOOKUP(A6,'Gruber Tabelle'!$A$5:$X$100,13,0)","v":0},{"$f":"VLOOKUP(A6,'Gruber Tabelle'!$A$5:$X$100,14,0)","v":0},{"$f":"VLOOKUP(A6,'Gruber Tabelle'!$A$5:$X$100,15,0)","v":0},{"$f":"VLOOKUP(A6,'Gruber Tabelle'!$A$5:$X$100,16,0)","v":0},{"$f":"VLOOKUP(A6,'Gruber Tabelle'!$A$5:$X$100,17,0)","v":0},{"$f":"VLOOKUP(A6,'Gruber Tabelle'!$A$5:$X$100,18,0)","v":0},{"$f":"VLOOKUP(A6,'Gruber Tabelle'!$A$5:$X$100,19,0)","v":0},{"$f":"VLOOKUP(A6,'Gruber Tabelle'!$A$5:$X$100,20,0)","v":0},{"$f":"VLOOKUP(A6,'Gruber Tabelle'!$A$5:$X$100,21,0)","v":0},{"$f":"VLOOKUP(A6,'Gruber Tabelle'!$A$5:$X$100,22,0)","v":0},{"$f":"VLOOKUP(A6,'Gruber Tabelle'!$A$5:$X$100,23,0)","v":0},{"$f":"VLOOKUP(A6,'Gruber Tabelle'!$A$5:$X$100,24,0)","v":0}]
[null,{"$f":"VLOOKUP(A7,'Gruber Tabelle'!A5:X100,2,0)","v":0},null,null,null,{"$f":"VLOOKUP(A7,'Gruber Tabelle'!$A$5:$X$100,4,0)","v":0},{"$f":"VLOOKUP(A7,'Gruber Tabelle'!$A$5:$X$100,5,0)","v":0},{"$f":"VLOOKUP(A7,'Gruber Tabelle'!$A$5:$X$100,6,0)","v":0},{"$f":"VLOOKUP(A7,'Gruber Tabelle'!$A$5:$X$100,7,0)","v":0},{"$f":"VLOOKUP(A7,'Gruber Tabelle'!$A$5:$X$100,8,0)","v":0},{"$f":"VLOOKUP(A7,'Gruber Tabelle'!$A$5:$X$100,9,0)","v":0},{"$f":"VLOOKUP(A7,'Gruber Tabelle'!$A$5:$X$100,10,0)","v":0},{"$f":"VLOOKUP(A7,'Gruber Tabelle'!$A$5:$X$100,11,0)","v":0},{"$f":"VLOOKUP(A7,'Gruber Tabelle'!$A$5:$X$100,12,0)","v":0},{"$f":"VLOOKUP(A7,'Gruber Tabelle'!$A$5:$X$100,13,0)","v":0},{"$f":"VLOOKUP(A7,'Gruber Tabelle'!$A$5:$X$100,14,0)","v":0},{"$f":"VLOOKUP(A7,'Gruber Tabelle'!$A$5:$X$100,15,0)","v":0},{"$f":"VLOOKUP(A7,'Gruber Tabelle'!$A$5:$X$100,16,0)","v":0},{"$f":"VLOOKUP(A7,'Gruber Tabelle'!$A$5:$X$100,17,0)","v":0},{"$f":"VLOOKUP(A7,'Gruber Tabelle'!$A$5:$X$100,18,0)","v":0},{"$f":"VLOOKUP(A7,'Gruber Tabelle'!$A$5:$X$100,19,0)","v":0},{"$f":"VLOOKUP(A7,'Gruber Tabelle'!$A$5:$X$100,20,0)","v":0},{"$f":"VLOOKUP(A7,'Gruber Tabelle'!$A$5:$X$100,21,0)","v":0},{"$f":"VLOOKUP(A7,'Gruber Tabelle'!$A$5:$X$100,22,0)","v":0},{"$f":"VLOOKUP(A7,'Gruber Tabelle'!$A$5:$X$100,23,0)","v":0},{"$f":"VLOOKUP(A7,'Gruber Tabelle'!$A$5:$X$100,24,0)","v":0}]
[null,{"$f":"VLOOKUP(A8,'Gruber Tabelle'!A5:X100,2,0)","v":0},null,null,null,{"$f":"VLOOKUP(A8,'Gruber Tabelle'!$A$5:$X$100,4,0)","v":0},{"$f":"VLOOKUP(A8,'Gruber Tabelle'!$A$5:$X$100,5,0)","v":0},{"$f":"VLOOKUP(A8,'Gruber Tabelle'!$A$5:$X$100,6,0)","v":0},{"$f":"VLOOKUP(A8,'Gruber Tabelle'!$A$5:$X$100,7,0)","v":0},{"$f":"VLOOKUP(A8,'Gruber Tabelle'!$A$5:$X$100,8,0)","v":0},{"$f":"VLOOKUP(A8,'Gruber Tabelle'!$A$5:$X$100,9,0)","v":0},{"$f":"VLOOKUP(A8,'Gruber Tabelle'!$A$5:$X$100,10,0)","v":0},{"$f":"VLOOKUP(A8,'Gruber Tabelle'!$A$5:$X$100,11,0)","v":0},{"$f":"VLOOKUP(A8,'Gruber Tabelle'!$A$5:$X$100,12,0)","v":0},{"$f":"VLOOKUP(A8,'Gruber Tabelle'!$A$5:$X$100,13,0)","v":0},{"$f":"VLOOKUP(A8,'Gruber Tabelle'!$A$5:$X$100,14,0)","v":0},{"$f":"VLOOKUP(A8,'Gruber Tabelle'!$A$5:$X$100,15,0)","v":0},{"$f":"VLOOKUP(A8,'Gruber Tabelle'!$A$5:$X$100,16,0)","v":0},{"$f":"VLOOKUP(A8,'Gruber Tabelle'!$A$5:$X$100,17,0)","v":0},{"$f":"VLOOKUP(A8,'Gruber Tabelle'!$A$5:$X$100,18,0)","v":0},{"$f":"VLOOKUP(A8,'Gruber Tabelle'!$A$5:$X$100,19,0)","v":0},{"$f":"VLOOKUP(A8,'Gruber Tabelle'!$A$5:$X$100,20,0)","v":0},{"$f":"VLOOKUP(A8,'Gruber Tabelle'!$A$5:$X$100,21,0)","v":0},{"$f":"VLOOKUP(A8,'Gruber Tabelle'!$A$5:$X$100,22,0)","v":0},{"$f":"VLOOKUP(A8,'Gruber Tabelle'!$A$5:$X$100,23,0)","v":0},{"$f":"VLOOKUP(A8,'Gruber Tabelle'!$A$5:$X$100,24,0)","v":0}]
{"$rows_left_out":28}
{"sheet":"Mischung 1","index":3,"n_rows":25,"n_cols":26,"rows_kept":25,"cut":false,"hidden":false,"merged":[[0,5,1,25],[0,0,1,4],[12,1,12,4],[13,0,13,1],[2,0,2,4],[24,0,24,1],[3,1,3,4],[4,1,4,4],[5,1,5,4],[6,1,6,4],[7,1,7,4],[8,1,8,4],[9,1,9,4],[10,1,10,4],[11,1,11,4]]}
[null,null,null,null,null,"Mischung 1"]
[]
["Mischung 1 zusammenstellen",null,null,null,null,"ME","XP g","Lys g","Met g","M+C g","Thr","Trp","Val","XF g","XS g","XZ g","XA g","Ca","P","vP g","vPph","Na","K","XL g","PFS g","Preis € / dt"]
[null,{"$f":"VLOOKUP(A4,'Gruber Tabelle'!A5:X100,2,0)","v":0},null,null,null,{"$f":"VLOOKUP(A4,'Gruber Tabelle'!$A$5:$X$100,4,0)","v":0},{"$f":"VLOOKUP(A4,'Gruber Tabelle'!$A$5:$X$100,5,0)","v":0},{"$f":"VLOOKUP(A4,'Gruber Tabelle'!$A$5:$X$100,6,0)","v":0},{"$f":"VLOOKUP(A4,'Gruber Tabelle'!$A$5:$X$100,7,0)","v":0},{"$f":"VLOOKUP(A4,'Gruber Tabelle'!$A$5:$X$100,8,0)","v":0},{"$f":"VLOOKUP(A4,'Gruber Tabelle'!$A$5:$X$100,9,0)","v":0},{"$f":"VLOOKUP(A4,'Gruber Tabelle'!$A$5:$X$100,10,0)","v":0},{"$f":"VLOOKUP(A4,'Gruber Tabelle'!$A$5:$X$100,11,0)","v":0},{"$f":"VLOOKUP(A4,'Gruber Tabelle'!$A$5:$X$100,12,0)","v":0},{"$f":"VLOOKUP(A4,'Gruber Tabelle'!$A$5:$X$100,13,0)","v":0},{"$f":"VLOOKUP(A4,'Gruber Tabelle'!$A$5:$X$100,14,0)","v":0},{"$f":"VLOOKUP(A4,'Gruber Tabelle'!$A$5:$X$100,15,0)","v":0},{"$f":"VLOOKUP(A4,'Gruber Tabelle'!$A$5:$X$100,16,0)","v":0},{"$f":"VLOOKUP(A4,'Gruber Tabelle'!$A$5:$X$100,17,0)","v":0},{"$f":"VLOOKUP(A4,'Gruber Tabelle'!$A$5:$X$100,18,0)","v":0},{"$f":"VLOOKUP(A4,'Gruber Tabelle'!$A$5:$X$100,19,0)","v":0},{"$f":"VLOOKUP(A4,'Gruber Tabelle'!$A$5:$X$100,20,0)","v":0},{"$f":"VLOOKUP(A4,'Gruber Tabelle'!$A$5:$X$100,21,0)","v":0},{"$f":"VLOOKUP(A4,'Gruber Tabelle'!$A$5:$X$100,22,0)","v":0},{"$f":"VLOOKUP(A4,'Gruber Tabelle'!$A$5:$X$100,23,0)","v":0},{"$f":"VLOOKUP(A4,'Gruber Tabelle'!$A$5:$X$100,24,0)","v":0}]
[null,{"$f":"VLOOKUP(A5,'Gruber Tabelle'!A5:X100,2,0)","v":0},null,null,null,{"$f":"VLOOKUP(A5,'Gruber Tabelle'!$A$5:$X$100,4,0)","v":0},{"$f":"VLOOKUP(A5,'Gruber Tabelle'!$A$5:$X$100,5,0)","v":0},{"$f":"VLOOKUP(A5,'Gruber Tabelle'!$A$5:$X$100,6,0)","v":0},{"$f":"VLOOKUP(A5,'Gruber Tabelle'!$A$5:$X$100,7,0)","v":0},{"$f":"VLOOKUP(A5,'Gruber Tabelle'!$A$5:$X$100,8,0)","v":0},{"$f":"VLOOKUP(A5,'Gruber Tabelle'!$A$5:$X$100,9,0)","v":0},{"$f":"VLOOKUP(A5,'Gruber Tabelle'!$A$5:$X$100,10,0)","v":0},{"$f":"VLOOKUP(A5,'Gruber Tabelle'!$A$5:$X$100,11,0)","v":0},{"$f":"VLOOKUP(A5,'Gruber Tabelle'!$A$5:$X$100,12,0)","v":0},{"$f":"VLOOKUP(A5,'Gruber Tabelle'!$A$5:$X$100,13,0)","v":0},{"$f":"VLOOKUP(A5,'Gruber Tabelle'!$A$5:$X$100,14,0)","v":0},{"$f":"VLOOKUP(A5,'Gruber Tabelle'!$A$5:$X$100,15,0)","v":0},{"$f":"VLOOKUP(A5,'Gruber Tabelle'!$A$5:$X$100,16,0)","v":0},{"$f":"VLOOKUP(A5,'Gruber Tabelle'!$A$5:$X$100,17,0)","v":0},{"$f":"VLOOKUP(A5,'Gruber Tabelle'!$A$5:$X$100,18,0)","v":0},{"$f":"VLOOKUP(A5,'Gruber Tabelle'!$A$5:$X$100,19,0)","v":0},{"$f":"VLOOKUP(A5,'Gruber Tabelle'!$A$5:$X$100,20,0)","v":0},{"$f":"VLOOKUP(A5,'Gruber Tabelle'!$A$5:$X$100,21,0)","v":0},{"$f":"VLOOKUP(A5,'Gruber Tabelle'!$A$5:$X$100,22,0)","v":0},{"$f":"VLOOKUP(A5,'Gruber Tabelle'!$A$5:$X$100,23,0)","v":0},{"$f":"VLOOKUP(A5,'Gruber Tabelle'!$A$5:$X$100,24,0)","v":0}]
[null,{"$f":"VLOOKUP(A6,'Gruber Tabelle'!A5:X100,2,0)","v":0},null,null,null,{"$f":"VLOOKUP(A6,'Gruber Tabelle'!$A$5:$X$100,4,0)","v":0},{"$f":"VLOOKUP(A6,'Gruber Tabelle'!$A$5:$X$100,5,0)","v":0},{"$f":"VLOOKUP(A6,'Gruber Tabelle'!$A$5:$X$100,6,0)","v":0},{"$f":"VLOOKUP(A6,'Gruber Tabelle'!$A$5:$X$100,7,0)","v":0},{"$f":"VLOOKUP(A6,'Gruber Tabelle'!$A$5:$X$100,8,0)","v":0},{"$f":"VLOOKUP(A6,'Gruber Tabelle'!$A$5:$X$100,9,0)","v":0},{"$f":"VLOOKUP(A6,'Gruber Tabelle'!$A$5:$X$100,10,0)","v":0},{"$f":"VLOOKUP(A6,'Gruber Tabelle'!$A$5:$X$100,11,0)","v":0},{"$f":"VLOOKUP(A6,'Gruber Tabelle'!$A$5:$X$100,12,0)","v":0},{"$f":"VLOOKUP(A6,'Gruber Tabelle'!$A$5:$X$100,13,0)","v":0},{"$f":"VLOOKUP(A6,'Gruber Tabelle'!$A$5:$X$100,14,0)","v":0},{"$f":"VLOOKUP(A6,'Gruber Tabelle'!$A$5:$X$100,15,0)","v":0},{"$f":"VLOOKUP(A6,'Gruber Tabelle'!$A$5:$X$100,16,0)","v":0},{"$f":"VLOOKUP(A6,'Gruber Tabelle'!$A$5:$X$100,17,0)","v":0},{"$f":"VLOOKUP(A6,'Gruber Tabelle'!$A$5:$X$100,18,0)","v":0},{"$f":"VLOOKUP(A6,'Gruber Tabelle'!$A$5:$X$100,19,0)","v":0},{"$f":"VLOOKUP(A6,'Gruber Tabelle'!$A$5:$X$100,20,0)","v":0},{"$f":"VLOOKUP(A6,'Gruber Tabelle'!$A$5:$X$100,21,0)","v":0},{"$f":"VLOOKUP(A6,'Gruber Tabelle'!$A$5:$X$100,22,0)","v":0},{"$f":"VLOOKUP(A6,'Gruber Tabelle'!$A$5:$X$100,23,0)","v":0},{"$f":"VLOOKUP(A6,'Gruber Tabelle'!$A$5:$X$100,24,0)","v":0}]
[null,{"$f":"VLOOKUP(A7,'Gruber Tabelle'!A5:X100,2,0)","v":0},null,null,null,{"$f":"VLOOKUP(A7,'Gruber Tabelle'!$A$5:$X$100,4,0)","v":0},{"$f":"VLOOKUP(A7,'Gruber Tabelle'!$A$5:$X$100,5,0)","v":0},{"$f":"VLOOKUP(A7,'Gruber Tabelle'!$A$5:$X$100,6,0)","v":0},{"$f":"VLOOKUP(A7,'Gruber Tabelle'!$A$5:$X$100,7,0)","v":0},{"$f":"VLOOKUP(A7,'Gruber Tabelle'!$A$5:$X$100,8,0)","v":0},{"$f":"VLOOKUP(A7,'Gruber Tabelle'!$A$5:$X$100,9,0)","v":0},{"$f":"VLOOKUP(A7,'Gruber Tabelle'!$A$5:$X$100,10,0)","v":0},{"$f":"VLOOKUP(A7,'Gruber Tabelle'!$A$5:$X$100,11,0)","v":0},{"$f":"VLOOKUP(A7,'Gruber Tabelle'!$A$5:$X$100,12,0)","v":0},{"$f":"VLOOKUP(A7,'Gruber Tabelle'!$A$5:$X$100,13,0)","v":0},{"$f":"VLOOKUP(A7,'Gruber Tabelle'!$A$5:$X$100,14,0)","v":0},{"$f":"VLOOKUP(A7,'Gruber Tabelle'!$A$5:$X$100,15,0)","v":0},{"$f":"VLOOKUP(A7,'Gruber Tabelle'!$A$5:$X$100,16,0)","v":0},{"$f":"VLOOKUP(A7,'Gruber Tabelle'!$A$5:$X$100,17,0)","v":0},{"$f":"VLOOKUP(A7,'Gruber Tabelle'!$A$5:$X$100,18,0)","v":0},{"$f":"VLOOKUP(A7,'Gruber Tabelle'!$A$5:$X$100,19,0)","v":0},{"$f":"VLOOKUP(A7,'Gruber Tabelle'!$A$5:$X$100,20,0)","v":0},{"$f":"VLOOKUP(A7,'Gruber Tabelle'!$A$5:$X$100,21,0)","v":0},{"$f":"VLOOKUP(A7,'Gruber Tabelle'!$A$5:$X$100,22,0)","v":0},{"$f":"VLOOKUP(A7,'Gruber Tabelle'!$A$5:$X$100,23,0)","v":0},{"$f":"VLOOKUP(A7,'Gruber Tabelle'!$A$5:$X$100,24,0)","v":0}]
[null,{"$f":"VLOOKUP(A8,'Gruber Tabelle'!A5:X100,2,0)","v":0},null,null,null,{"$f":"VLOOKUP(A8,'Gruber Tabelle'!$A$5:$X$100,4,0)","v":0},{"$f":"VLOOKUP(A8,'Gruber Tabelle'!$A$5:$X$100,5,0)","v":0},{"$f":"VLOOKUP(A8,'Gruber Tabelle'!$A$5:$X$100,6,0)","v":0},{"$f":"VLOOKUP(A8,'Gruber Tabelle'!$A$5:$X$100,7,0)","v":0},{"$f":"VLOOKUP(A8,'Gruber Tabelle'!$A$5:$X$100,8,0)","v":0},{"$f":"VLOOKUP(A8,'Gruber Tabelle'!$A$5:$X$100,9,0)","v":0},{"$f":"VLOOKUP(A8,'Gruber Tabelle'!$A$5:$X$100,10,0)","v":0},{"$f":"VLOOKUP(A8,'Gruber Tabelle'!$A$5:$X$100,11,0)","v":0},{"$f":"VLOOKUP(A8,'Gruber Tabelle'!$A$5:$X$100,12,0)","v":0},{"$f":"VLOOKUP(A8,'Gruber Tabelle'!$A$5:$X$100,13,0)","v":0},{"$f":"VLOOKUP(A8,'Gruber Tabelle'!$A$5:$X$100,14,0)","v":0},{"$f":"VLOOKUP(A8,'Gruber Tabelle'!$A$5:$X$100,15,0)","v":0},{"$f":"VLOOKUP(A8,'Gruber Tabelle'!$A$5:$X$100,16,0)","v":0},{"$f":"VLOOKUP(A8,'Gruber Tabelle'!$A$5:$X$100,17,0)","v":0},{"$f":"VLOOKUP(A8,'Gruber Tabelle'!$A$5:$X$100,18,0)","v":0},{"$f":"VLOOKUP(A8,'Gruber Tabelle'!$A$5:$X$100,19,0)","v":0},{"$f":"VLOOKUP(A8,'Gruber Tabelle'!$A$5:$X$100,20,0)","v":0},{"$f":"VLOOKUP(A8,'Gruber Tabelle'!$A$5:$X$100,21,0)","v":0},{"$f":"VLOOKUP(A8,'Gruber Tabelle'!$A$5:$X$100,22,0)","v":0},{"$f":"VLOOKUP(A8,'Gruber Tabelle'!$A$5:$X$100,23,0)","v":0},{"$f":"VLOOKUP(A8,'Gruber Tabelle'!$A$5:$X$100,24,0)","v":0}]
{"$rows_left_out":18}
{"sheet":"Gruber Tabelle","index":4,"n_rows":100,"n_cols":24,"rows_kept":100,"cut":false,"hidden":false,"merged":[[1,0,3,1],[1,2,1,5],[1,6,1,22],[0,2,0,23],[0,0,0,1],[2,6,2,22],[2,2,2,5]]}
["Ration"]
[null,null,"www.LfL.bayern.de",null,null,null,"Gruber Tabelle  27. Auflage, August 2022",null,null,null,null,null,null,null,null,null,null,null,null,null,null,null,null,"Preis"]
[null,null,null,null,null,null,"Gehaltswerte der Futtermittel - Angaben in kg Frischmasse",null,null,null,null,null,null,null,null,null,null,null,null,null,null,null,null,"FM"]
[null,null,"TM g","ME","XP g","Lys g","Met g","M+C g","Thr","Trp","Val","XF g","XS g","XZ g","XA g","Ca","P","vP g","vPph","Na","K","XL g","PFS g","€ / dt"]
[null,"Getreide"]
[4025,"Gerste",880,11.59,110,3.92,1.81,4.18,3.61,1.36,5.33,44,530,22,22,0.6,3.5,1.6,2.2999999999999998,0.3,4.4000000000000004,22,9]
[4026,"Gerste mehrzeilig",880,11.51,110,3.92,1.81,4.18,3.61,1.36,5.33,46,528,23,22,0.6,3.5,1.6,2.2999999999999998,0.3,4.4000000000000004,20,8]
[4005,"Menggetreide",880,11.59,110,3.92,1.81,4.18,3.61,1.36,4.58,44,530,22,22,0.6,3.5,1.6,2.2999999999999998,0.3,4.4000000000000004,22,9]
{"$rows_left_out":93}
{"sheet":"Mengenberechnung","index":5,"n_rows":25,"n_cols":7,"rows_kept":25,"cut":false,"hidden":false,"merged":[[21,1,21,3],[21,5,24,6],[22,1,22,3],[23,1,23,3],[24,1,24,3],[17,1,17,3],[17,5,20,6],[18,1,18,3],[19,1,19,3],[20,1,20,3],[13,0,13,4],[14,1,14,3],[14,5,14,6],[15,1,15,3],[16,1,16,3],[9,1,9,3],[5,5,8,6],[9,5,12,6],[10,1,10,3],[11,1,11,3],[12,1,12,3],[4,1,4,3],[5,1,5,3],[6,1,6,3],[7,1,7,3],[8,1,8,3],[0,0,0,6],[1,0,1,4],[2,1,2,3],[2,5,2,6],[3,1,3,3]]}
[]
["Basis – Ration             Mischergröße:",null,null,null,null,null,"kg"]
["Kenn Nr.","Futtermittel",null,null,"kg."]
[{"$f":"Ration!A15","v":0},{"$f":"Ration!B15","v":0},null,null,{"$f":"IF(F2>0,F2*Ration!D15/1000,0)","v":0},"Tiere gesamt:"]
[{"$f":"Ration!A16","v":0},{"$f":"Ration!B16","v":0},null,null,{"$f":"IF(F2>0,F2*Ration!D16/1000,0)","v":0},"kg je Tier/Tag:"]
[{"$f":"Ration!A17","v":0},{"$f":"Ration!B17","v":0},null,null,{"$f":"IF(F2>0,F2*Ration!D17/1000,0)","v":0},"Die Mischung reicht für Tage :"]
[{"$f":"Ration!A18","v":0},{"$f":"Ration!B18","v":0},null,null,{"$f":"IF(F2>0,F2*Ration!D18/1000,0)","v":0}]
[{"$f":"Ration!A19","v":0},{"$f":"Ration!B19","v":0},null,null,{"$f":"IF(F2>0,F2*Ration!D19/1000,0)","v":0}]
{"$rows_left_out":18}
{"sheet":"Ausdruck","index":6,"n_rows":50,"n_cols":11,"rows_kept":50,"cut":false,"hidden":false,"merged":[[7,5,7,7],[8,5,8,7],[9,5,9,7],[37,9,37,10],[35,9,35,10],[36,9,36,10],[30,9,30,10],[31,9,31,10],[31,5,31,7],[29,9,29,10],[25,0,25,10],[31,1,31,3],[37,0,37,3],[37,5,37,7],[33,9,33,10],[33,5,33,7],[32,9,32,10],[32,5,32,7],[33,2,33,3],[35,0,36,2],[35,3,36,3],[32,0,32,3],[33,0,33,1],[34,0,34,3],[34,9,34,10],[34,5,34,7],[35,5,35,7],[36,5,36,7],[29,0,29,1],[29,2,29,3],[30,0,30,3],[28,9,28,10],[26,0,28,1],[26,2,28,3],[27,9,27,10],[27,5,27,7],[28,5,28,7],[29,5,29,7],[30,5,30,7],[26,4,26,10],[13,0,13,1],[24,0,24,1],[10,0,11,2],[10,3,11,3],[12,9,12,10],[10,9,10,10],[11,9,11,10],[12,5,12,7],[10,5,10,7],[11,5,11,7],[12,0,12,3],[5,9,5,10],[6,9,6,10],[4,9,4,10],[5,0,5,3],[6,1,6,3],[5,5,5,7],[6,5,6,7],[4,0,4,1],[4,2,4,3],[9,0,9,3],[9,9,9,10],[8,0,8,1],[8,2,8,3],[8,9,8,10],[1,0,3,1],[1,2,3,3],[1,4,1,10],[2,9,2,10],[3,9,3,10],[0,0,0,10],[23,0,23,1],[22,0,22,1],[21,0,21,1],[20,0,20,1],[19,0,19,1],[18,0,18,1],[17,0,17,1],[16,0,16,1],[15,0,15,1],[14,0,14,1],[7,9,7,10],[7,0,7,3],[2,5,2,7],[3,5,3,7],[4,5,4,7],[48,0,48,1],[49,0,49,1],[43,0,43,1],[44,0,44,1],[45,0,45,1],[46,0,46,1],[47,0,47,1],[38,0,38,1],[39,0,39,1],[40,0,40,1],[41,0,41,1],[42,0,42,1]]}
[]
[null,null,"www.triesdorf.de",null,"Basis - Ration"]
[null,null,null,null,"Kenn - Nr.","Futtermittelbezeichnung",null,null,"Anteil %","Mischungsanteil kg"]
[null,null,null,null,{"$f":"Ration!A15","v":0},{"$f":"Ration!B15","v":0},null,null,{"$f":"Ration!C15","v":0},{"$f":"Mengenberechnung!E4","v":0}]
[{"$f":"Einstellung!C6","v":"Tierhaltungsschule"},null,{"$f":"Einstellung!E6","v":"Triesdorf"},null,{"$f":"Ration!A16","v":0},{"$f":"Ration!B16","v":0},null,null,{"$f":"Ration!C16","v":0},{"$f":"Mengenberechnung!E5","v":0}]
[{"$f":"Einstellung!C7","v":"Markgrafenstraße 1"},null,null,null,{"$f":"Ration!A17","v":0},{"$f":"Ration!B17","v":0},null,null,{"$f":"Ration!C17","v":0},{"$f":"Mengenberechnung!E6","v":0}]
[{"$f":"Einstellung!C8","v":91746},{"$f":"Einstellung!D8","v":"Weidenbach"},null,null,{"$f":"Ration!A18","v":0},{"$f":"Ration!B18","v":0},null,null,{"$f":"Ration!C18","v":0},{"$f":"Mengenberechnung!E7","v":0}]
[null,null,null,null,{"$f":"Ration!A19","v":0},{"$f":"Ration!B19","v":0},null,null,{"$f":"Ration!C19","v":0},{"$f":"Mengenberechnung!E8","v":0}]
{"$rows_left_out":42}