{"text_format":"1","workbook":"xlsx","n_sheets":8,"sheets":["Einstellung","Sollwerte","Ration","Mischung 1","Mischung 2","Gruber Tabelle","Mengenberechnung","Ausdruck"],"not_rendered":{"charts":0,"images":14,"macros":1,"external_links":0,"defined_names":4,"comments":3,"pivot_tables":0},"unopened":[],"bounds":{"document_bytes":16777216,"sheet_cells":100000,"rows_first":2000,"rows_last":500,"rows_between":2000,"halvings":0,"cell_chars":16384,"cell_head_chars":4096},"cells_cut":0,"cells_raw":0,"read":"whole","date_system":"1900"}

{"sheet":"Einstellung","index":0,"n_rows":23,"n_cols":8,"rows_kept":23,"cut":false,"hidden":false,"merged":[[22,2,22,5],[17,2,17,5],[0,0,23,0],[24,1,24,12],[1,1,1,16],[3,7,3,16],[2,7,2,16],[4,1,7,1],[8,2,9,5],[10,2,11,5],[4,4,4,5],[4,2,4,3],[5,2,5,5],[6,3,6,5],[7,3,7,5],[12,2,13,5]]}
[]
[]
[null,null,null,null,null,null,null,"Futterberechnung zur Fütterung der Schafe und Ziegen"]
[null,null,null,null,null,null,null,"Gruber Tabelle, 48.  Auflage / August 2023    www.LfL.Bayern.de"]
[null,null,"Tierhaltungsschule",null,"Triesdorf"]
[null,null,"Markgrafenstraße 1"]
{"$rows_left_out":18}
{"sheet":"Sollwerte","index":1,"n_rows":75,"n_cols":15,"rows_kept":75,"cut":false,"hidden":false,"merged":[[1,0,2,14],[0,0,0,14]]}
[]
["Richtwerte zur Nährstoffversorgung aus Gruber Tabelle S. 60 ff        Alle Felder können mit eigenen Werten überschrieben werden.        "]
[]
["Tier","Kenn - Nr.","TM / Tag g","aNDFom","XP","nXP","ME/MJ","NEL/MJ"," Ca g","P g","Mg g","Na g","K g","Cl g","S g"]
["Sollwerte aus Liste wählen  >>>",0,0,0,0,0,0,null,0,0,0,0,0]
["Mutterschaf 70 kg (leer/niedertragend)",1,1250,250,90,90,11,null,5,4,1,1,10]
{"$rows_left_out":70}
{"sheet":"Ration","index":2,"n_rows":32,"n_cols":20,"rows_kept":32,"cut":false,"hidden":false,"merged":[[0,4,0,18],[0,2,0,3],[0,19,1,19],[28,0,28,19],[25,0,25,2],[26,0,26,2],[30,5,31,5],[24,0,24,2],[1,5,1,18],[29,0,29,2],[30,0,31,3],[3,2,12,3],[2,2,2,3],[1,0,1,3],[27,0,27,2],[30,6,31,6]]}
[null,null,"Bitte eine Tierart aus der Liste auswählen!"]
[null,null,null,null,null,"Nähr- und Mineralstoffgehalte in 1000 g Trockenmasse"]
["Nr.","Futterart",null,null,"TM g","XF g","aNDFom g"," XP g","nXP g","ME Mj","NEL Mj","Ca","P","Mg","Na","K","Cl","S","Preis / dt FM","Typ"]
[null,{"$f":"IFERROR(VLOOKUP(A4,'Gruber Tabelle'!$A$8:$W$404,2,0),\"\")","v":0},null,null,{"$f":"IFERROR(VLOOKUP(A4,'Gruber Tabelle'!$A$8:$W$404,3,0),\"\")","v":0},{"$f":"IFERROR(VLOOKUP(A4,'Gruber Tabelle'!$A$8:$W$404,4,0),\"\")","v":0},{"$f":"IFERROR(VLOOKUP(A4,'Gruber Tabelle'!$A$8:$W$404,5,0),\"\")","v":0},{"$f":"IFERROR(VLOOKUP(A4,'Gruber Tabelle'!$A$8:$W$404,7,0),\"\")","v":0},{"$f":"IFERROR(VLOOKUP(A4,'Gruber Tabelle'!$A$8:$W$404,8,0),\"\")","v":0},{"$f":"IFERROR(VLOOKUP(A4,'Gruber Tabelle'!$A$8:$W$404,12,0),\"\")","v":0},{"$f":"IFERROR(VLOOKUP(A4,'Gruber Tabelle'!$A$8:$W$404,11,0),\"\")","v":0},{"$f":"IFERROR(VLOOKUP(A4,'Gruber Tabelle'!$A$8:$W$404,16,0),\"\")","v":0},{"$f":"IFERROR(VLOOKUP(A4,'Gruber Tabelle'!$A$8:$W$404,17,0),\"\")","v":0},{"$f":"IFERROR(VLOOKUP(A4,'Gruber Tabelle'!$A$8:$W$404,18,0),\"\")","v":0},{"$f":"IFERROR(VLOOKUP(A4,'Gruber Tabelle'!$A$8:$W$404,19,0),\"\")","v":0},{"$f":"IFERROR(VLOOKUP(A4,'Gruber Tabelle'!$A$8:$W$404,20,0),\"\")","v":0},{"$f":"IFERROR(VLOOKUP(A4,'Gruber Tabelle'!$A$8:$W$404,21,0),\"\")","v":0},{"$f":"IFERROR(VLOOKUP(A4,'Gruber Tabelle'!$A$8:$W$404,22,0),\"\")","v":0},{"$f":"IFERROR(VLOOKUP(A4,'Gruber Tabelle'!$A$8:$W$404,23,0),\"\")","v":0},{"$f":"IFERROR(VLOOKUP(A4,'Gruber Tabelle'!$A$8:$X$404,24,0),\"\")","v":0}]
[null,{"$f":"IFERROR(VLOOKUP(A5,'Gruber Tabelle'!$A$8:$W$404,2,0),\"\")","v":0},null,null,{"$f":"IFERROR(VLOOKUP(A5,'Gruber Tabelle'!$A$8:$W$404,3,0),\"\")","v":0},{"$f":"IFERROR(VLOOKUP(A5,'Gruber Tabelle'!$A$8:$W$404,4,0),\"\")","v":0},{"$f":"IFERROR(VLOOKUP(A5,'Gruber Tabelle'!$A$8:$W$404,5,0),\"\")","v":0},{"$f":"IFERROR(VLOOKUP(A5,'Gruber Tabelle'!$A$8:$W$404,7,0),\"\")","v":0},{"$f":"IFERROR(VLOOKUP(A5,'Gruber Tabelle'!$A$8:$W$404,8,0),\"\")","v":0},{"$f":"IFERROR(VLOOKUP(A5,'Gruber Tabelle'!$A$8:$W$404,12,0),\"\")","v":0},{"$f":"IFERROR(VLOOKUP(A5,'Gruber Tabelle'!$A$8:$W$404,11,0),\"\")","v":0},{"$f":"IFERROR(VLOOKUP(A5,'Gruber Tabelle'!$A$8:$W$404,16,0),\"\")","v":0},{"$f":"IFERROR(VLOOKUP(A5,'Gruber Tabelle'!$A$8:$W$404,17,0),\"\")","v":0},{"$f":"IFERROR(VLOOKUP(A5,'Gruber Tabelle'!$A$8:$W$404,18,0),\"\")","v":0},{"$f":"IFERROR(VLOOKUP(A5,'Gruber Tabelle'!$A$8:$W$404,19,0),\"\")","v":0},{"$f":"IFERROR(VLOOKUP(A5,'Gruber Tabelle'!$A$8:$W$404,20,0),\"\")","v":0},{"$f":"IFERROR(VLOOKUP(A5,'Gruber Tabelle'!$A$8:$W$404,21,0),\"\")","v":0},{"$f":"IFERROR(VLOOKUP(A5,'Gruber Tabelle'!$A$8:$W$404,22,0),\"\")","v":0},{"$f":"IFERROR(VLOOKUP(A5,'Gruber Tabelle'!$A$8:$W$404,23,0),\"\")","v":0},{"$f":"IFERROR(VLOOKUP(A5,'Gruber Tabelle'!$A$8:$X$404,24,0),\"\")","v":0}]
[null,{"$f":"IFERROR(VLOOKUP(A6,'Gruber Tabelle'!$A$8:$W$404,2,0),\"\")","v":0},null,null,{"$f":"IFERROR(VLOOKUP(A6,'Gruber Tabelle'!$A$8:$W$404,3,0),\"\")","v":0},{"$f":"IFERROR(VLOOKUP(A6,'Gruber Tabelle'!$A$8:$W$404,4,0),\"\")","v":0},{"$f":"IFERROR(VLOOKUP(A6,'Gruber Tabelle'!$A$8:$W$404,5,0),\"\")","v":0},{"$f":"IFERROR(VLOOKUP(A6,'Gruber Tabelle'!$A$8:$W$404,7,0),\"\")","v":0},{"$f":"IFERROR(VLOOKUP(A6,'Gruber Tabelle'!$A$8:$W$404,8,0),\"\")","v":0},{"$f":"IFERROR(VLOOKUP(A6,'Gruber Tabelle'!$A$8:$W$404,12,0),\"\")","v":0},{"$f":"IFERROR(VLOOKUP(A6,'Gruber Tabelle'!$A$8:$W$404,11,0),\"\")","v":0},{"$f":"IFERROR(VLOOKUP(A6,'Gruber Tabelle'!$A$8:$W$404,16,0),\"\")","v":0},{"$f":"IFERROR(VLOOKUP(A6,'Gruber Tabelle'!$A$8:$W$404,17,0),\"\")","v":0},{"$f":"IFERROR(VLOOKUP(A6,'Gruber Tabelle'!$A$8:$W$404,18,0),\"\")","v":0},{"$f":"IFERROR(VLOOKUP(A6,'Gruber Tabelle'!$A$8:$W$404,19,0),\"\")","v":0},{"$f":"IFERROR(VLOOKUP(A6,'Gruber Tabelle'!$A$8:$W$404,20,0),\"\")","v":0},{"$f":"IFERROR(VLOOKUP(A6,'Gruber Tabelle'!$A$8:$W$404,21,0),\"\")","v":0},{"$f":"IFERROR(VLOOKUP(A6,'Gruber Tabelle'!$A$8:$W$404,22,0),\"\")","v":0},{"$f":"IFERROR(VLOOKUP(A6,'Gruber Tabelle'!$A$8:$W$404,23,0),\"\")","v":0},{"$f":"IFERROR(VLOOKUP(A6,'Gruber Tabelle'!$A$8:$X$404,24,0),\"\")","v":0}]
{"$rows_left_out":27}
{"sheet":"Mischung 1","index":3,"n_rows":25,"n_cols":20,"rows_kept":25,"cut":false,"hidden":false,"merged":[[0,0,0,19],[1,0,1,4],[1,6,1,19],[2,1,2,4],[3,2,12,4]]}
[]
["Kraftfutter – Mischung 1",null,null,null,null,null,"Nähr- und Mineralstoffgehalte je kg TM"]
["Nr ","Futterart",null,null,null,"TM g","XF g","aNDFom g","XP g","nXP g","ME Mj","NEL  Mj","Ca","P","Mg","Na","K","Cl","S","Preis / dt FM"]
[null,{"$f":"IFERROR(VLOOKUP(A4,'Gruber Tabelle'!$A$8:$W$405,2,0),\"\")","v":0},null,null,null,{"$f":"IFERROR(VLOOKUP(A4,'Gruber Tabelle'!$A$8:$W$404,3,0),\"\")","v":0},{"$f":"IFERROR(VLOOKUP(A4,'Gruber Tabelle'!$A$8:$W$404,4,0),\"\")","v":0},{"$f":"IFERROR(VLOOKUP(A4,'Gruber Tabelle'!$A$8:$W$404,5,0),\"\")","v":0},{"$f":"IFERROR(VLOOKUP(A4,'Gruber Tabelle'!$A$8:$W$404,7,0),\"\")","v":0},{"$f":"IFERROR(VLOOKUP(A4,'Gruber Tabelle'!$A$8:$W$404,8,0),\"\")","v":0},{"$f":"IFERROR(VLOOKUP(A4,'Gruber Tabelle'!$A$5:$W$404,12,0),\"\")","v":0},{"$f":"IFERROR(VLOOKUP(A4,'Gruber Tabelle'!$A$5:$W$404,11,0),\"\")","v":0},{"$f":"IFERROR(VLOOKUP(A4,'Gruber Tabelle'!$A$8:$W$404,16,0),\"\")","v":0},{"$f":"IFERROR(VLOOKUP(A4,'Gruber Tabelle'!$A$8:$W$404,17,0),\"\")","v":0},{"$f":"IFERROR(VLOOKUP(A4,'Gruber Tabelle'!$A$8:$W$404,18,0),\"\")","v":0},{"$f":"IFERROR(VLOOKUP(A4,'Gruber Tabelle'!$A$8:$W$404,19,0),\"\")","v":0},{"$f":"IFERROR(VLOOKUP(A4,'Gruber Tabelle'!$A$8:$W$404,20,0),\"\")","v":0},{"$f":"IFERROR(VLOOKUP(A4,'Gruber Tabelle'!$A$8:$W$404,21,0),\"\")","v":0},{"$f":"IFERROR(VLOOKUP(A4,'Gruber Tabelle'!$A$8:$W$404,22,0),\"\")","v":0},{"$f":"IFERROR(VLOOKUP(A4,'Gruber Tabelle'!$A$8:$W$404,23,0),\"\")","v":0}]
[null,{"$f":"IFERROR(VLOOKUP(A5,'Gruber Tabelle'!$A$8:$W$405,2,0),\"\")","v":0},null,null,null,{"$f":"IFERROR(VLOOKUP(A5,'Gruber Tabelle'!$A$8:$W$404,3,0),\"\")","v":0},{"$f":"IFERROR(VLOOKUP(A5,'Gruber Tabelle'!$A$8:$W$404,4,0),\"\")","v":0},{"$f":"IFERROR(VLOOKUP(A5,'Gruber Tabelle'!$A$8:$W$404,5,0),\"\")","v":0},{"$f":"IFERROR(VLOOKUP(A5,'Gruber Tabelle'!$A$8:$W$404,7,0),\"\")","v":0},{"$f":"IFERROR(VLOOKUP(A5,'Gruber Tabelle'!$A$8:$W$404,8,0),\"\")","v":0},{"$f":"IFERROR(VLOOKUP(A5,'Gruber Tabelle'!$A$5:$W$404,12,0),\"\")","v":0},{"$f":"IFERROR(VLOOKUP(A5,'Gruber Tabelle'!$A$5:$W$404,11,0),\"\")","v":0},{"$f":"IFERROR(VLOOKUP(A5,'Gruber Tabelle'!$A$8:$W$404,16,0),\"\")","v":0},{"$f":"IFERROR(VLOOKUP(A5,'Gruber Tabelle'!$A$8:$W$404,17,0),\"\")","v":0},{"$f":"IFERROR(VLOOKUP(A5,'Gruber Tabelle'!$A$8:$W$404,18,0),\"\")","v":0},{"$f":"IFERROR(VLOOKUP(A5,'Gruber Tabelle'!$A$8:$W$404,19,0),\"\")","v":0},{"$f":"IFERROR(VLOOKUP(A5,'Gruber Tabelle'!$A$8:$W$404,20,0),\"\")","v":0},{"$f":"IFERROR(VLOOKUP(A5,'Gruber Tabelle'!$A$8:$W$404,21,0),\"\")","v":0},{"$f":"IFERROR(VLOOKUP(A5,'Gruber Tabelle'!$A$8:$W$404,22,0),\"\")","v":0},{"$f":"IFERROR(VLOOKUP(A5,'Gruber Tabelle'!$A$8:$W$404,23,0),\"\")","v":0}]
[null,{"$f":"IFERROR(VLOOKUP(A6,'Gruber Tabelle'!$A$8:$W$405,2,0),\"\")","v":0},null,null,null,{"$f":"IFERROR(VLOOKUP(A6,'Gruber Tabelle'!$A$8:$W$404,3,0),\"\")","v":0},{"$f":"IFERROR(VLOOKUP(A6,'Gruber Tabelle'!$A$8:$W$404,4,0),\"\")","v":0},{"$f":"IFERROR(VLOOKUP(A6,'Gruber Tabelle'!$A$8:$W$404,5,0),\"\")","v":0},{"$f":"IFERROR(VLOOKUP(A6,'Gruber Tabelle'!$A$8:$W$404,7,0),\"\")","v":0},{"$f":"IFERROR(VLOOKUP(A6,'Gruber Tabelle'!$A$8:$W$404,8,0),\"\")","v":0},{"$f":"IFERROR(VLOOKUP(A6,'Gruber Tabelle'!$A$5:$W$404,12,0),\"\")","v":0},{"$f":"IFERROR(VLOOKUP(A6,'Gruber Tabelle'!$A$5:$W$404,11,0),\"\")","v":0},{"$f":"IFERROR(VLOOKUP(A6,'Gruber Tabelle'!$A$8:$W$404,16,0),\"\")","v":0},{"$f":"IFERROR(VLOOKUP(A6,'Gruber Tabelle'!$A$8:$W$404,17,0),\"\")","v":0},{"$f":"IFERROR(VLOOKUP(A6,'Gruber Tabelle'!$A$8:$W$404,18,0),\"\")","v":0},{"$f":"IFERROR(VLOOKUP(A6,'Gruber Tabelle'!$A$8:$W$404,19,0),\"\")","v":0},{"$f":"IFERROR(VLOOKUP(A6,'Gruber Tabelle'!$A$8:$W$404,20,0),\"\")","v":0},{"$f":"IFERROR(VLOOKUP(A6,'Gruber Tabelle'!$A$8:$W$404,21,0),\"\")","v":0},{"$f":"IFERROR(VLOOKUP(A6,'Gruber Tabelle'!$A$8:$W$404,22,0),\"\")","v":0},{"$f":"IFERROR(VLOOKUP(A6,'Gruber Tabelle'!$A$8:$W$404,23,0),\"\")","v":0}]
{"$rows_left_out":20}
{"sheet":"Mischung 2","index":4,"n_rows":25,"n_cols":20,"rows_kept":25,"cut":false,"hidden":false,"merged":[[0,0,0,19],[1,0,1,4],[2,1,2,4],[3,2,12,4],[1,5,1,19]]}
[]
["Kraftfutter – Mischung 2",null,null,null,null,"Nähr- und Mineralstoffgehalte je kg TM"]
["Nr ","Futterart",null,null,null,"TM g","XF  g","aNDFom g","XP g","nXP g","ME Mj","NEL Mj","Ca","P","Mg","Na","K","Cl","S","Preis / dt FM"]
[null,{"$f":"IFERROR(VLOOKUP(A4,'Gruber Tabelle'!$A$8:$W$405,2,0),\"\")","v":0},null,null,null,{"$f":"IFERROR(VLOOKUP(A4,'Gruber Tabelle'!$A$8:$W$404,3,0),\"\")","v":0},{"$f":"IFERROR(VLOOKUP(A4,'Gruber Tabelle'!$A$8:$W$404,4,0),\"\")","v":0},{"$f":"IFERROR(VLOOKUP(A4,'Gruber Tabelle'!$A$8:$W$404,5,0),\"\")","v":0},{"$f":"IFERROR(VLOOKUP(A4,'Gruber Tabelle'!$A$8:$W$404,7,0),\"\")","v":0},{"$f":"IFERROR(VLOOKUP(A4,'Gruber Tabelle'!$A$8:$W$404,8,0),\"\")","v":0},{"$f":"IFERROR(VLOOKUP(A4,'Gruber Tabelle'!$A$8:$W$404,12,0),\"\")","v":0},{"$f":"IFERROR(VLOOKUP(A4,'Gruber Tabelle'!$A$8:$W$404,11,0),\"\")","v":0},{"$f":"IFERROR(VLOOKUP(A4,'Gruber Tabelle'!$A$8:$W$404,16,0),\"\")","v":0},{"$f":"IFERROR(VLOOKUP(A4,'Gruber Tabelle'!$A$8:$W$404,17,0),\"\")","v":0},{"$f":"IFERROR(VLOOKUP(A4,'Gruber Tabelle'!$A$8:$W$404,18,0),\"\")","v":0},{"$f":"IFERROR(VLOOKUP(A4,'Gruber Tabelle'!$A$8:$W$404,19,0),\"\")","v":0},{"$f":"IFERROR(VLOOKUP(A4,'Gruber Tabelle'!$A$8:$W$404,20,0),\"\")","v":0},{"$f":"IFERROR(VLOOKUP(A4,'Gruber Tabelle'!$A$8:$W$404,21,0),\"\")","v":0},{"$f":"IFERROR(VLOOKUP(A4,'Gruber Tabelle'!$A$8:$W$404,22,0),\"\")","v":0},{"$f":"IFERROR(VLOOKUP(A4,'Gruber Tabelle'!$A$8:$W$404,23,0),\"\")","v":0}]
[null,{"$f":"IFERROR(VLOOKUP(A5,'Gruber Tabelle'!$A$8:$W$405,2,0),\"\")","v":0},null,null,null,{"$f":"IFERROR(VLOOKUP(A5,'Gruber Tabelle'!$A$8:$W$404,3,0),\"\")","v":0},{"$f":"IFERROR(VLOOKUP(A5,'Gruber Tabelle'!$A$8:$W$404,4,0),\"\")","v":0},{"$f":"IFERROR(VLOOKUP(A5,'Gruber Tabelle'!$A$8:$W$404,5,0),\"\")","v":0},{"$f":"IFERROR(VLOOKUP(A5,'Gruber Tabelle'!$A$8:$W$404,7,0),\"\")","v":0},{"$f":"IFERROR(VLOOKUP(A5,'Gruber Tabelle'!$A$8:$W$404,8,0),\"\")","v":0},{"$f":"IFERROR(VLOOKUP(A5,'Gruber Tabelle'!$A$8:$W$404,12,0),\"\")","v":0},{"$f":"IFERROR(VLOOKUP(A5,'Gruber Tabelle'!$A$8:$W$404,11,0),\"\")","v":0},{"$f":"IFERROR(VLOOKUP(A5,'Gruber Tabelle'!$A$8:$W$404,16,0),\"\")","v":0},{"$f":"IFERROR(VLOOKUP(A5,'Gruber Tabelle'!$A$8:$W$404,17,0),\"\")","v":0},{"$f":"IFERROR(VLOOKUP(A5,'Gruber Tabelle'!$A$8:$W$404,18,0),\"\")","v":0},{"$f":"IFERROR(VLOOKUP(A5,'Gruber Tabelle'!$A$8:$W$404,19,0),\"\")","v":0},{"$f":"IFERROR(VLOOKUP(A5,'Gruber Tabelle'!$A$8:$W$404,20,0),\"\")","v":0},{"$f":"IFERROR(VLOOKUP(A5,'Gruber Tabelle'!$A$8:$W$404,21,0),\"\")","v":0},{"$f":"IFERROR(VLOOKUP(A5,'Gruber Tabelle'!$A$8:$W$404,22,0),\"\")","v":0},{"$f":"IFERROR(VLOOKUP(A5,'Gruber Tabelle'!$A$8:$W$404,23,0),\"\")","v":0}]
[null,{"$f":"IFERROR(VLOOKUP(A6,'Gruber Tabelle'!$A$8:$W$405,2,0),\"\")","v":0},null,null,null,{"$f":"IFERROR(VLOOKUP(A6,'Gruber Tabelle'!$A$8:$W$404,3,0),\"\")","v":0},{"$f":"IFERROR(VLOOKUP(A6,'Gruber Tabelle'!$A$8:$W$404,4,0),\"\")","v":0},{"$f":"IFERROR(VLOOKUP(A6,'Gruber Tabelle'!$A$8:$W$404,5,0),\"\")","v":0},{"$f":"IFERROR(VLOOKUP(A6,'Gruber Tabelle'!$A$8:$W$404,7,0),\"\")","v":0},{"$f":"IFERROR(VLOOKUP(A6,'Gruber Tabelle'!$A$8:$W$404,8,0),\"\")","v":0},{"$f":"IFERROR(VLOOKUP(A6,'Gruber Tabelle'!$A$8:$W$404,12,0),\"\")","v":0},{"$f":"IFERROR(VLOOKUP(A6,'Gruber Tabelle'!$A$8:$W$404,11,0),\"\")","v":0},{"$f":"IFERROR(VLOOKUP(A6,'Gruber Tabelle'!$A$8:$W$404,16,0),\"\")","v":0},{"$f":"IFERROR(VLOOKUP(A6,'Gruber Tabelle'!$A$8:$W$404,17,0),\"\")","v":0},{"$f":"IFERROR(VLOOKUP(A6,'Gruber Tabelle'!$A$8:$W$404,18,0),\"\")","v":0},{"$f":"IFERROR(VLOOKUP(A6,'Gruber Tabelle'!$A$8:$W$404,19,0),\"\")","v":0},{"$f":"IFERROR(VLOOKUP(A6,'Gruber Tabelle'!$A$8:$W$404,20,0),\"\")","v":0},{"$f":"IFERROR(VLOOKUP(A6,'Gruber Tabelle'!$A$8:$W$404,21,0),\"\")","v":0},{"$f":"IFERROR(VLOOKUP(A6,'Gruber Tabelle'!$A$8:$W$404,22,0),\"\")","v":0},{"$f":"IFERROR(VLOOKUP(A6,'Gruber Tabelle'!$A$8:$W$404,23,0),\"\")","v":0}]
{"$rows_left_out":20}
{"sheet":"Gruber Tabelle","index":5,"n_rows":388,"n_cols":24,"rows_kept":388,"cut":false,"hidden":false,"merged":[[1,2,1,6],[2,2,3,2],[2,3,2,21],[0,0,0,23],[1,7,1,23],[3,23,4,23]]}
["Ration"]
[null,null,"www.LfL.bayern.de",null,null,null,null,"Gruber Tabelle zur Fütterung der Milchkühe – Zuchtrinder – Mastrinder – Schafe – Ziegen"]
[null,null,"TM","in 1000 g Trockenmasse ( TM )",null,null,null,null,null,null,null,null,null,null,null,null,null,null,null,null,null,null,"Preis","Typ"]
[null,null,null,"XF","aNDF","ADF","XP","nXP","UDP","RNB","NEL","ME","XS+XZ","bXS","XL","Ca","P","Mg","Na","K","Cl","S","FM"]
[null,null,"g","g","om g","om g","g","g","%","g","MJ","MJ","g","g","g","g","g","g","g","g","g","g","€ / dt"]
[null,"10.1 Grünfutter",null,null,null,null,null,null,null,{"$f":"(G6-H6)/6.25","v":0}]
{"$rows_left_out":383}
{"sheet":"Mengenberechnung","index":6,"n_rows":39,"n_cols":7,"rows_kept":39,"cut":false,"hidden":false,"merged":[[35,1,35,3],[35,5,38,6],[36,1,36,3],[37,1,37,3],[38,1,38,3],[31,5,34,6],[32,1,32,3],[33,1,33,3],[34,1,34,3],[23,1,23,3],[23,5,26,6],[24,1,24,3],[25,1,25,3],[26,1,26,3],[27,0,27,4],[28,1,28,3],[28,5,28,6],[29,1,29,3],[30,1,30,3],[31,1,31,3],[19,1,19,3],[19,5,22,6],[20,1,20,3],[21,1,21,3],[22,1,22,3],[15,0,15,4],[16,1,16,3],[16,5,16,6],[17,1,17,3],[18,1,18,3],[10,1,10,3],[10,5,14,6],[11,1,11,3],[12,1,12,3],[13,1,13,3],[14,1,14,3],[0,0,0,6],[1,0,1,4],[2,1,2,3],[2,5,2,6],[3,1,3,3],[3,5,9,6],[4,1,4,3],[5,1,5,3],[6,1,6,3],[7,1,7,3],[8,1,8,3],[9,1,9,3]]}
[]
["Basis – Ration für :",null,null,null,null,null,"Tiere"]
["Kenn Nr.","Futtermittel",null,null,"kg."]
[{"$f":"Ration!A15","v":0},{"$f":"Ration!B15","v":0},null,null,{"$f":"Ration!D15*F2","v":0},"Gesamtgewicht Grundfutter und Kraftfutter pro Mischung in kg:"]
[{"$f":"Ration!A16","v":0},{"$f":"Ration!B16","v":0},null,null,{"$f":"Ration!D16*F2","v":0}]
[{"$f":"Ration!A17","v":0},{"$f":"Ration!B17","v":0},null,null,{"$f":"Ration!D17*F2","v":0}]
{"$rows_left_out":34}
{"sheet":"Ausdruck","index":7,"n_rows":32,"n_cols":38,"rows_kept":32,"cut":false,"hidden":false,"merged":[[12,34,12,36],[14,34,14,36],[13,34,13,36],[15,34,15,36],[16,34,16,36],[12,37,12,38],[13,37,13,38],[14,37,14,38],[15,37,15,38],[16,37,16,38],[10,37,10,38],[11,37,11,38],[7,34,7,36],[6,34,6,36],[8,34,8,36],[9,34,9,36],[10,34,10,36],[11,34,11,36],[5,26,5,31],[6,37,6,38],[7,37,7,38],[8,37,8,38],[9,37,9,38],[6,32,17,32],[5,33,5,38],[6,30,6,31],[17,30,17,31],[7,30,7,31],[8,30,8,31],[9,30,9,31],[10,30,10,31],[11,30,11,31],[12,30,12,31],[13,30,13,31],[31,26,31,27],[16,27,16,29],[17,27,17,29],[17,37,17,38],[17,34,17,36],[19,26,19,27],[20,26,20,27],[21,26,21,27],[29,28,29,32],[22,28,22,32],[26,28,26,32],[27,28,27,32],[28,28,28,32],[23,28,23,32],[24,28,24,32],[25,28,25,32],[16,30,16,31],[19,14,19,16],[18,13,18,25],[10,14,10,16],[11,14,11,16],[12,14,12,16],[13,14,13,16],[15,27,15,29],[0,26,0,27],[0,28,0,30],[1,26,1,28],[1,29,1,30],[2,26,2,30],[3,26,3,27],[3,28,3,30],[6,27,6,29],[7,27,7,29],[8,27,8,29],[9,27,9,29],[10,27,10,29],[14,30,14,31],[15,30,15,31],[14,14,14,16],[3,15,3,17],[6,14,6,16],[7,14,7,16],[0,13,0,14],[0,15,0,17],[1,13,1,15],[1,16,1,17],[2,19,3,25],[31,13,31,14],[5,13,5,25],[29,14,29,16],[30,14,30,16],[24,14,24,16],[25,14,25,16],[26,14,26,16],[27,14,27,16],[28,14,28,16],[15,14,15,16],[16,14,16,16],[17,14,17,16],[22,14,22,16],[23,14,23,16],[20,14,20,16],[21,14,21,16],[8,14,8,16],[9,14,9,16],[0,19,1,25],[28,2,28,3],[28,7,28,8],[28,9,28,10],[9,1,9,3],[10,1,10,3],[11,1,11,3],[12,1,12,3],[25,2,25,3],[0,0,0,12],[2,5,2,9],[2,10,2,12],[27,7,27,8],[27,9,27,10],[1,0,1,1],[1,2,1,4],[1,5,1,7],[1,8,1,12],[2,0,2,2],[2,3,2,4],[2,13,2,17],[3,13,3,14],[3,10,3,12],[4,5,4,7],[23,11,23,12],[24,11,24,12],[25,11,25,12],[26,11,26,12],[27,11,27,12],[23,0,23,1],[23,2,23,3],[23,7,23,8],[23,9,23,10],[23,4,23,5],[24,0,24,1],[24,2,24,3],[24,7,24,8],[24,9,24,10],[25,0,25,1],[25,4,25,5],[25,7,25,8],[25,9,25,10],[27,0,27,1],[27,2,27,3],[26,0,26,1],[26,2,26,3],[19,1,19,3],[20,1,20,3],[13,1,13,3],[14,1,14,3],[15,1,15,3],[16,1,16,3],[17,1,17,3],[4,9,4,11],[22,0,22,12],[3,0,3,4],[4,0,4,1],[4,2,4,4],[6,1,6,3],[7,1,7,3],[8,1,8,3],[3,5,3,9],[5,0,5,12],[18,1,18,3],[28,0,28,1],[31,0,31,1],[31,2,31,3],[31,4,31,5],[31,7,31,8],[31,9,31,10],[29,0,29,1],[30,0,30,1],[29,2,29,3],[30,2,30,3],[29,4,29,5],[30,4,30,5],[28,4,28,5],[31,11,31,12],[29,9,29,10],[29,7,29,8],[30,11,30,12],[29,11,29,12],[30,7,30,10],[26,7,26,8],[26,9,26,10],[24,4,24,5],[27,4,27,5],[28,11,28,12],[26,4,26,5],[0,34,3,38],[30,26,30,27],[30,28,30,32],[31,28,31,32],[18,26,18,32],[18,34,19,36],[18,37,19,38],[21,34,22,36],[21,37,22,38],[22,26,22,27],[23,26,23,27],[24,26,24,27],[25,26,25,27],[26,26,26,27],[27,26,27,27],[28,26,28,27],[29,26,29,27],[19,28,19,32],[20,28,20,32],[21,28,21,32],[11,27,11,29],[12,27,12,29],[13,27,13,29],[14,27,14,29]]}
[null,null,null,null,null,null,null,null,null,null,null,null,null,"Betriebs Nr.",null,{"$f":"Einstellung!D8","v":"091231234444"},null,null,null,"Kraftfutter - Mischung 1",null,null,null,null,null,null,"Betriebs Nr.",null,{"$f":"Einstellung!D8","v":"091231234444"},null,null,null,null,null,"Mengenliste für Futtermischer"]
["Betriebs Nr.",null,{"$f":"Einstellung!D8","v":"091231234444"},null,null,"Basis Ration",null,null,{"$f":"Ration!A2","v":0},null,null,null,null,{"$f":"Einstellung!C5","v":"Tierhaltungsschule"},null,null,{"$f":"Einstellung!E5","v":"Triesdorf"},null,null,null,null,null,null,null,null,null,{"$f":"Einstellung!C5","v":"Tierhaltungsschule"},null,null,{"$f":"Einstellung!E5","v":"Triesdorf"}]
[{"$f":"Einstellung!C5","v":"Tierhaltungsschule"},null,null,{"$f":"Einstellung!E5","v":"Triesdorf"},null,"kg Grundfutter und KF - FM ges.",null,null,null,null,{"$f":"Ration!D28","v":0},null,null,{"$f":"Einstellung!C6","v":"Markgrafenstraße 1"},null,null,null,null,null,"Kraftfutter - Mischung 2",null,null,null,null,null,null,{"$f":"Einstellung!C6","v":"Markgrafenstraße 1"}]
[{"$f":"Einstellung!C6","v":"Markgrafenstraße 1"},null,null,null,null,"kg Grundfutter und KF - TM ges.",null,null,null,null,{"$f":"Ration!E28/1000","v":0},null,null,{"$f":"Einstellung!C7","v":91746},null,{"$f":"Einstellung!D7","v":"Weidenbach"},null,null,null,null,null,null,null,null,null,null,{"$f":"Einstellung!C7","v":91746},null,{"$f":"Einstellung!D7","v":"Weidenbach"}]
[{"$f":"Einstellung!C7","v":91746},null,{"$f":"Einstellung!D7","v":"Weidenbach"},null,null,"KF 1 kg",null,null,{"$f":"Ration!D26","v":0},"KF 2 kg",null,null,{"$f":"Ration!D27","v":0}]
[null,null,null,null,null,null,null,null,null,null,null,null,null,null,null,null,null,null,null,null,null,null,null,null,null,null,"Kraftfutter - Mischung 1",null,null,null,null,null,null,"Kraftfutter - Mischung 2"]
{"$rows_left_out":26}