{"text_format":"1","workbook":"xlsx","n_sheets":8,"sheets":["Einstellung","Sollwerte","Gruber Tabelle","Ration","Mischung 1","Grundfutter","Mengenberechnung","Ausdruck"],"not_rendered":{"charts":0,"images":11,"macros":1,"external_links":0,"defined_names":4,"comments":3,"pivot_tables":0},"unopened":[],"bounds":{"document_bytes":16777216,"sheet_cells":100000,"rows_first":2000,"rows_last":500,"rows_between":2000,"halvings":0,"cell_chars":16384,"cell_head_chars":4096},"cells_cut":0,"cells_raw":0,"read":"whole","date_system":"1900"}

{"sheet":"Einstellung","index":0,"n_rows":17,"n_cols":5,"rows_kept":17,"cut":false,"hidden":false,"merged":[[24,1,24,12],[7,3,7,5],[9,3,9,5],[8,2,8,5],[11,2,11,5],[16,2,16,5],[13,2,13,5],[19,2,22,5],[1,1,1,16],[2,1,2,16],[3,1,3,16],[15,1,15,4],[10,1,10,4],[4,6,23,16],[5,2,5,3],[5,4,5,5],[6,2,6,5],[14,1,14,4]]}
[]
[]
[null,"Futterberechnung zur Fütterung von Schweinen"]
[null,"Gruber Tabelle, 27. Auflage / August 2022             www.LfL.bayern.de"]
[]
[null,null,"Tierhaltungsschule",null,"Triesdorf"]
{"$rows_left_out":12}
{"sheet":"Sollwerte","index":1,"n_rows":68,"n_cols":31,"rows_kept":68,"cut":false,"hidden":false,"merged":[[1,29,1,30],[2,29,2,30],[0,0,0,30],[1,2,1,20],[1,21,1,28],[2,21,2,28]]}
[]
[null,null,"Richtwerte je kg Trockenfutter 88 -  weiße Leerzeilen sind für eigene Eingaben vorgesehen",null,null,null,null,null,null,null,null,null,null,null,null,null,null,null,null,null,null,"  Aminosäurenrelationen ",null,null,null,null,null,null,null,"Verhältnis"]
[null,null,"FM g","ME","XP","Lys","Met","M+C","Thr","Trp","XF","St","XZ","XA","Ca","P","vP g","vPph","Na","K","XL","(Lys : Met : M+C : Thr : Trp : Val : Ile : Leu )",null,null,null,null,null,null,null,"C  :  vP"]
["Richtwerte je kg Futter bei 88 % TM","Nr.","Tag","MJ","g","g","g","g","g","g","g","g","g","g","g","g","g","g","g","g","g","Lys","Met","M+C","Thr","Trp","Val","Ile","Leu","C","vP"]
["Bitte Richtwerte auswählen  >>",0,0,0,0,0,0,0,0,0,0,0,0,0,0,0,0,0,0,0,0]
["Jungsauenaufzucht LM 30-60       LMZ 650 g",1,2050,12,166,8.4600000000000009,2.62,4.6500000000000004,5.5,1.52,40,430,35,24,4.9000000000000004,3.7,2.1,2.1,0.8,7,40,1,0,0.55000000000000004,0.65,0.18,0.65,0.5,1.03,2.4,1]
{"$rows_left_out":63}
{"sheet":"Gruber Tabelle","index":2,"n_rows":231,"n_cols":22,"rows_kept":231,"cut":false,"hidden":false,"merged":[[2,0,4,1],[2,2,2,5],[0,0,0,21],[2,6,2,20],[2,21,4,21],[3,2,3,7],[3,8,3,14],[3,15,3,20]]}
["Ration"]
[]
[null,null,"www.LfL.bayern.de",null,null,null,"Gruber Tabelle zur Futterberechnung für Schweine - 27. Auflage - August 2022",null,null,null,null,null,null,null,null,null,null,null,null,null,null,"Preis   dt FM"]
[null,null,"grau = Trockenfutter 880 g TM",null,null,null,null,null,"weiß = Leerzeilen für eigene Futtermittel",null,null,null,null,null,null,"grün = Grundfuttermittel Frischmasse"]
[null,null,"TM","ME","XP ","Lys ","Met ","M+C ","Thr","Trp","XF ","St","Z","XA","Ca","P","vP","vPph","Na","K","XL"]
[null,"Futtermittel","g","MJ","g","g","g","g","g","g","g","g","g","g","g","g","g","g","g","g","g","€ / dt"]
{"$rows_left_out":226}
{"sheet":"Ration","index":3,"n_rows":35,"n_cols":24,"rows_kept":35,"cut":false,"hidden":false,"merged":[[1,1,1,4],[3,1,3,4],[4,1,4,4],[5,1,5,4],[2,0,2,4],[0,0,0,23],[34,16,35,16],[6,1,6,4],[7,1,7,4],[8,1,8,4],[9,1,9,4],[10,1,10,4],[25,0,25,1],[11,1,11,4],[12,1,12,4],[24,0,24,1],[13,0,13,1],[34,17,35,17],[28,0,28,4],[32,17,33,17],[26,0,26,1],[27,0,27,1],[30,0,30,16383],[31,0,31,4],[32,0,32,4],[33,0,33,4],[32,16,33,16],[29,0,29,4],[34,5,35,5],[34,6,35,6],[34,7,35,7],[34,8,35,8],[34,0,35,4]]}
[]
[{"$f":"VLOOKUP(B2,Sollwerte!$A$5:$J$68,2,0)","v":0},"Bitte Richtwerte auswählen  >>",null,null,null,"ME","XP","Lys","Met","M+C","Thr","Trp","XF","St","Z","XA","Ca","P","vP","vPph","Na","K","XL","Kosten"]
["Trockenfuttermischung - Zusammenstellung",null,null,null,null,"MJ","g","g","g","g","g","g","g","g","g","g","g","g","g","g","g","g","g","€ / dt FM"]
[null,{"$f":"VLOOKUP(A4,'Gruber Tabelle'!$A$7:$V$231,2,0)","v":0},null,null,null,{"$f":"VLOOKUP(A4,'Gruber Tabelle'!$A$7:$V$231,4,0)","v":0},{"$f":"VLOOKUP(A4,'Gruber Tabelle'!$A$7:$V$231,5,0)","v":0},{"$f":"VLOOKUP(A4,'Gruber Tabelle'!$A$7:$V$231,6,0)","v":0},{"$f":"VLOOKUP(A4,'Gruber Tabelle'!$A$7:$V$231,7,0)","v":0},{"$f":"VLOOKUP(A4,'Gruber Tabelle'!$A$7:$V$231,8,0)","v":0},{"$f":"VLOOKUP(A4,'Gruber Tabelle'!$A$7:$V$231,9,0)","v":0},{"$f":"VLOOKUP(A4,'Gruber Tabelle'!$A$7:$V$231,10,0)","v":0},{"$f":"VLOOKUP(A4,'Gruber Tabelle'!$A$7:$V$231,11,0)","v":0},{"$f":"VLOOKUP(A4,'Gruber Tabelle'!$A$7:$V$231,12,0)","v":0},{"$f":"VLOOKUP(A4,'Gruber Tabelle'!$A$7:$V$231,13,0)","v":0},{"$f":"VLOOKUP(A4,'Gruber Tabelle'!$A$7:$V$231,14,0)","v":0},{"$f":"VLOOKUP(A4,'Gruber Tabelle'!$A$7:$V$231,15,0)","v":0},{"$f":"VLOOKUP(A4,'Gruber Tabelle'!$A$7:$V$231,16,0)","v":0},{"$f":"VLOOKUP(A4,'Gruber Tabelle'!$A$7:$V$231,17,0)","v":0},{"$f":"VLOOKUP(A4,'Gruber Tabelle'!$A$7:$V$231,18,0)","v":0},{"$f":"VLOOKUP(A4,'Gruber Tabelle'!$A$7:$V$231,19,0)","v":0},{"$f":"VLOOKUP(A4,'Gruber Tabelle'!$A$7:$V$231,20,0)","v":0},{"$f":"VLOOKUP(A4,'Gruber Tabelle'!$A$7:$V$231,21,0)","v":0},{"$f":"VLOOKUP(A4,'Gruber Tabelle'!$A$7:$V$231,22,0)","v":0}]
[null,{"$f":"VLOOKUP(A5,'Gruber Tabelle'!$A$7:$V$231,2,0)","v":0},null,null,null,{"$f":"VLOOKUP(A5,'Gruber Tabelle'!$A$7:$V$231,4,0)","v":0},{"$f":"VLOOKUP(A5,'Gruber Tabelle'!$A$7:$V$231,5,0)","v":0},{"$f":"VLOOKUP(A5,'Gruber Tabelle'!$A$7:$V$231,6,0)","v":0},{"$f":"VLOOKUP(A5,'Gruber Tabelle'!$A$7:$V$231,7,0)","v":0},{"$f":"VLOOKUP(A5,'Gruber Tabelle'!$A$7:$V$231,8,0)","v":0},{"$f":"VLOOKUP(A5,'Gruber Tabelle'!$A$7:$V$231,9,0)","v":0},{"$f":"VLOOKUP(A5,'Gruber Tabelle'!$A$7:$V$231,10,0)","v":0},{"$f":"VLOOKUP(A5,'Gruber Tabelle'!$A$7:$V$231,11,0)","v":0},{"$f":"VLOOKUP(A5,'Gruber Tabelle'!$A$7:$V$231,12,0)","v":0},{"$f":"VLOOKUP(A5,'Gruber Tabelle'!$A$7:$V$231,13,0)","v":0},{"$f":"VLOOKUP(A5,'Gruber Tabelle'!$A$7:$V$231,14,0)","v":0},{"$f":"VLOOKUP(A5,'Gruber Tabelle'!$A$7:$V$231,15,0)","v":0},{"$f":"VLOOKUP(A5,'Gruber Tabelle'!$A$7:$V$231,16,0)","v":0},{"$f":"VLOOKUP(A5,'Gruber Tabelle'!$A$7:$V$231,17,0)","v":0},{"$f":"VLOOKUP(A5,'Gruber Tabelle'!$A$7:$V$231,18,0)","v":0},{"$f":"VLOOKUP(A5,'Gruber Tabelle'!$A$7:$V$231,19,0)","v":0},{"$f":"VLOOKUP(A5,'Gruber Tabelle'!$A$7:$V$231,20,0)","v":0},{"$f":"VLOOKUP(A5,'Gruber Tabelle'!$A$7:$V$231,21,0)","v":0},{"$f":"VLOOKUP(A5,'Gruber Tabelle'!$A$7:$V$231,22,0)","v":0}]
[null,{"$f":"VLOOKUP(A6,'Gruber Tabelle'!$A$7:$V$231,2,0)","v":0},null,null,null,{"$f":"VLOOKUP(A6,'Gruber Tabelle'!$A$7:$V$231,4,0)","v":0},{"$f":"VLOOKUP(A6,'Gruber Tabelle'!$A$7:$V$231,5,0)","v":0},{"$f":"VLOOKUP(A6,'Gruber Tabelle'!$A$7:$V$231,6,0)","v":0},{"$f":"VLOOKUP(A6,'Gruber Tabelle'!$A$7:$V$231,7,0)","v":0},{"$f":"VLOOKUP(A6,'Gruber Tabelle'!$A$7:$V$231,8,0)","v":0},{"$f":"VLOOKUP(A6,'Gruber Tabelle'!$A$7:$V$231,9,0)","v":0},{"$f":"VLOOKUP(A6,'Gruber Tabelle'!$A$7:$V$231,10,0)","v":0},{"$f":"VLOOKUP(A6,'Gruber Tabelle'!$A$7:$V$231,11,0)","v":0},{"$f":"VLOOKUP(A6,'Gruber Tabelle'!$A$7:$V$231,12,0)","v":0},{"$f":"VLOOKUP(A6,'Gruber Tabelle'!$A$7:$V$231,13,0)","v":0},{"$f":"VLOOKUP(A6,'Gruber Tabelle'!$A$7:$V$231,14,0)","v":0},{"$f":"VLOOKUP(A6,'Gruber Tabelle'!$A$7:$V$231,15,0)","v":0},{"$f":"VLOOKUP(A6,'Gruber Tabelle'!$A$7:$V$231,16,0)","v":0},{"$f":"VLOOKUP(A6,'Gruber Tabelle'!$A$7:$V$231,17,0)","v":0},{"$f":"VLOOKUP(A6,'Gruber Tabelle'!$A$7:$V$231,18,0)","v":0},{"$f":"VLOOKUP(A6,'Gruber Tabelle'!$A$7:$V$231,19,0)","v":0},{"$f":"VLOOKUP(A6,'Gruber Tabelle'!$A$7:$V$231,20,0)","v":0},{"$f":"VLOOKUP(A6,'Gruber Tabelle'!$A$7:$V$231,21,0)","v":0},{"$f":"VLOOKUP(A6,'Gruber Tabelle'!$A$7:$V$231,22,0)","v":0}]
{"$rows_left_out":30}
{"sheet":"Mischung 1","index":4,"n_rows":25,"n_cols":24,"rows_kept":25,"cut":false,"hidden":false,"merged":[[12,1,12,4],[13,0,13,1],[2,0,2,4],[24,0,24,1],[0,0,0,23],[1,0,1,4],[3,1,3,4],[4,1,4,4],[5,1,5,4],[6,1,6,4],[7,1,7,4],[8,1,8,4],[9,1,9,4],[10,1,10,4],[11,1,11,4]]}
[]
["Kraftfutter – Mischung 1",null,null,null,null,"ME","XP","Lys","Met","M+C","Thr","Trp","XF","St","Z","XA","Ca","P","vP","vPph","Na","K","XL","Kosten"]
["Zusatzmischung zu Basis-Ration,  nur für Trockenfutter",null,null,null,null,"MJ","g","g","g","g","g","g","g","g","g","g","g","g","g","g","g","g","g","€ / dt FM"]
[null,{"$f":"VLOOKUP(A4,'Gruber Tabelle'!$A$7:$V$231,2,0)","v":0},null,null,null,{"$f":"VLOOKUP(A4,'Gruber Tabelle'!$A$7:$V$231,4,0)","v":0},{"$f":"VLOOKUP(A4,'Gruber Tabelle'!$A$7:$V$231,5,0)","v":0},{"$f":"VLOOKUP(A4,'Gruber Tabelle'!$A$7:$V$231,6,0)","v":0},{"$f":"VLOOKUP(A4,'Gruber Tabelle'!$A$7:$V$231,7,0)","v":0},{"$f":"VLOOKUP(A4,'Gruber Tabelle'!$A$7:$V$231,8,0)","v":0},{"$f":"VLOOKUP(A4,'Gruber Tabelle'!$A$7:$V$231,9,0)","v":0},{"$f":"VLOOKUP(A4,'Gruber Tabelle'!$A$7:$V$231,10,0)","v":0},{"$f":"VLOOKUP(A4,'Gruber Tabelle'!$A$7:$V$231,11,0)","v":0},{"$f":"VLOOKUP(A4,'Gruber Tabelle'!$A$7:$V$231,12,0)","v":0},{"$f":"VLOOKUP(A4,'Gruber Tabelle'!$A$7:$V$231,13,0)","v":0},{"$f":"VLOOKUP(A4,'Gruber Tabelle'!$A$7:$V$231,14,0)","v":0},{"$f":"VLOOKUP(A4,'Gruber Tabelle'!$A$7:$V$231,15,0)","v":0},{"$f":"VLOOKUP(A4,'Gruber Tabelle'!$A$7:$V$231,16,0)","v":0},{"$f":"VLOOKUP(A4,'Gruber Tabelle'!$A$7:$V$231,17,0)","v":0},{"$f":"VLOOKUP(A4,'Gruber Tabelle'!$A$7:$V$231,18,0)","v":0},{"$f":"VLOOKUP(A4,'Gruber Tabelle'!$A$7:$V$231,19,0)","v":0},{"$f":"VLOOKUP(A4,'Gruber Tabelle'!$A$7:$V$231,20,0)","v":0},{"$f":"VLOOKUP(A4,'Gruber Tabelle'!$A$7:$V$231,21,0)","v":0},{"$f":"VLOOKUP(A4,'Gruber Tabelle'!$A$7:$V$231,22,0)","v":0}]
[null,{"$f":"VLOOKUP(A5,'Gruber Tabelle'!$A$7:$V$231,2,0)","v":0},null,null,null,{"$f":"VLOOKUP(A5,'Gruber Tabelle'!$A$7:$V$231,4,0)","v":0},{"$f":"VLOOKUP(A5,'Gruber Tabelle'!$A$7:$V$231,5,0)","v":0},{"$f":"VLOOKUP(A5,'Gruber Tabelle'!$A$7:$V$231,6,0)","v":0},{"$f":"VLOOKUP(A5,'Gruber Tabelle'!$A$7:$V$231,7,0)","v":0},{"$f":"VLOOKUP(A5,'Gruber Tabelle'!$A$7:$V$231,8,0)","v":0},{"$f":"VLOOKUP(A5,'Gruber Tabelle'!$A$7:$V$231,9,0)","v":0},{"$f":"VLOOKUP(A5,'Gruber Tabelle'!$A$7:$V$231,10,0)","v":0},{"$f":"VLOOKUP(A5,'Gruber Tabelle'!$A$7:$V$231,11,0)","v":0},{"$f":"VLOOKUP(A5,'Gruber Tabelle'!$A$7:$V$231,12,0)","v":0},{"$f":"VLOOKUP(A5,'Gruber Tabelle'!$A$7:$V$231,13,0)","v":0},{"$f":"VLOOKUP(A5,'Gruber Tabelle'!$A$7:$V$231,14,0)","v":0},{"$f":"VLOOKUP(A5,'Gruber Tabelle'!$A$7:$V$231,15,0)","v":0},{"$f":"VLOOKUP(A5,'Gruber Tabelle'!$A$7:$V$231,16,0)","v":0},{"$f":"VLOOKUP(A5,'Gruber Tabelle'!$A$7:$V$231,17,0)","v":0},{"$f":"VLOOKUP(A5,'Gruber Tabelle'!$A$7:$V$231,18,0)","v":0},{"$f":"VLOOKUP(A5,'Gruber Tabelle'!$A$7:$V$231,19,0)","v":0},{"$f":"VLOOKUP(A5,'Gruber Tabelle'!$A$7:$V$231,20,0)","v":0},{"$f":"VLOOKUP(A5,'Gruber Tabelle'!$A$7:$V$231,21,0)","v":0},{"$f":"VLOOKUP(A5,'Gruber Tabelle'!$A$7:$V$231,22,0)","v":0}]
[null,{"$f":"VLOOKUP(A6,'Gruber Tabelle'!$A$7:$V$231,2,0)","v":0},null,null,null,{"$f":"VLOOKUP(A6,'Gruber Tabelle'!$A$7:$V$231,4,0)","v":0},{"$f":"VLOOKUP(A6,'Gruber Tabelle'!$A$7:$V$231,5,0)","v":0},{"$f":"VLOOKUP(A6,'Gruber Tabelle'!$A$7:$V$231,6,0)","v":0},{"$f":"VLOOKUP(A6,'Gruber Tabelle'!$A$7:$V$231,7,0)","v":0},{"$f":"VLOOKUP(A6,'Gruber Tabelle'!$A$7:$V$231,8,0)","v":0},{"$f":"VLOOKUP(A6,'Gruber Tabelle'!$A$7:$V$231,9,0)","v":0},{"$f":"VLOOKUP(A6,'Gruber Tabelle'!$A$7:$V$231,10,0)","v":0},{"$f":"VLOOKUP(A6,'Gruber Tabelle'!$A$7:$V$231,11,0)","v":0},{"$f":"VLOOKUP(A6,'Gruber Tabelle'!$A$7:$V$231,12,0)","v":0},{"$f":"VLOOKUP(A6,'Gruber Tabelle'!$A$7:$V$231,13,0)","v":0},{"$f":"VLOOKUP(A6,'Gruber Tabelle'!$A$7:$V$231,14,0)","v":0},{"$f":"VLOOKUP(A6,'Gruber Tabelle'!$A$7:$V$231,15,0)","v":0},{"$f":"VLOOKUP(A6,'Gruber Tabelle'!$A$7:$V$231,16,0)","v":0},{"$f":"VLOOKUP(A6,'Gruber Tabelle'!$A$7:$V$231,17,0)","v":0},{"$f":"VLOOKUP(A6,'Gruber Tabelle'!$A$7:$V$231,18,0)","v":0},{"$f":"VLOOKUP(A6,'Gruber Tabelle'!$A$7:$V$231,19,0)","v":0},{"$f":"VLOOKUP(A6,'Gruber Tabelle'!$A$7:$V$231,20,0)","v":0},{"$f":"VLOOKUP(A6,'Gruber Tabelle'!$A$7:$V$231,21,0)","v":0},{"$f":"VLOOKUP(A6,'Gruber Tabelle'!$A$7:$V$231,22,0)","v":0}]
{"$rows_left_out":20}
{"sheet":"Grundfutter","index":5,"n_rows":36,"n_cols":24,"rows_kept":36,"cut":false,"hidden":false,"merged":[[23,1,23,2],[13,0,13,2],[8,1,8,2],[9,1,9,2],[10,1,10,2],[11,1,11,2],[18,1,18,2],[19,1,19,2],[20,1,20,2],[21,1,21,2],[22,1,22,2],[12,1,12,2],[14,1,14,2],[15,1,15,2],[16,1,16,2],[17,1,17,2],[6,1,6,2],[7,1,7,2],[2,1,2,2],[0,0,0,23],[3,1,3,2],[4,1,4,2],[5,1,5,2],[1,0,1,3],[24,0,24,2],[26,0,26,2],[27,0,27,2],[25,0,25,23],[28,0,28,23],[31,0,31,23],[32,0,32,4],[33,0,33,4],[34,0,34,4],[29,0,29,3],[30,0,30,3],[35,0,36,4],[38,0,38,4],[33,16,34,16],[33,17,34,17],[35,16,36,16],[35,17,36,17],[35,5,36,5],[35,6,36,6],[35,7,36,7],[35,8,36,8]]}
[]
["Grundfutter, Heu, Stroh, Silagen",null,null,null,null,"ME","XP","Lys","Met","M+C","Thr","Trp","XF","St","Z","XA","Ca","P","vP","vPph","Na","K","XL","Kosten"]
[null,"Futter",null,"TM g",null,"MJ","g","g","g","g","g","g","g","g","g","g","g","g","g","g","g","g","g","€ / dt FM"]
[null,{"$f":"VLOOKUP(A4,'Gruber Tabelle'!$A$7:$V$231,2,0)","v":0},null,{"$f":"VLOOKUP(A4,'Gruber Tabelle'!$A$7:$V$231,3,0)","v":0},null,{"$f":"VLOOKUP(A4,'Gruber Tabelle'!$A$7:$V$231,4,0)","v":0},{"$f":"VLOOKUP(A4,'Gruber Tabelle'!$A$7:$V$231,5,0)","v":0},{"$f":"VLOOKUP(A4,'Gruber Tabelle'!$A$7:$V$231,6,0)","v":0},{"$f":"VLOOKUP(A4,'Gruber Tabelle'!$A$7:$V$231,7,0)","v":0},{"$f":"VLOOKUP(A4,'Gruber Tabelle'!$A$7:$V$231,8,0)","v":0},{"$f":"VLOOKUP(A4,'Gruber Tabelle'!$A$7:$V$231,9,0)","v":0},{"$f":"VLOOKUP(A4,'Gruber Tabelle'!$A$7:$V$231,10,0)","v":0},{"$f":"VLOOKUP(A4,'Gruber Tabelle'!$A$7:$V$231,11,0)","v":0},{"$f":"VLOOKUP(A4,'Gruber Tabelle'!$A$7:$V$231,12,0)","v":0},{"$f":"VLOOKUP(A4,'Gruber Tabelle'!$A$7:$V$231,13,0)","v":0},{"$f":"VLOOKUP(A4,'Gruber Tabelle'!$A$7:$V$231,14,0)","v":0},{"$f":"VLOOKUP(A4,'Gruber Tabelle'!$A$7:$V$231,15,0)","v":0},{"$f":"VLOOKUP(A4,'Gruber Tabelle'!$A$7:$V$231,16,0)","v":0},{"$f":"VLOOKUP(A4,'Gruber Tabelle'!$A$7:$V$231,17,0)","v":0},{"$f":"VLOOKUP(A4,'Gruber Tabelle'!$A$7:$V$231,18,0)","v":0},{"$f":"VLOOKUP(A4,'Gruber Tabelle'!$A$7:$V$231,19,0)","v":0},{"$f":"VLOOKUP(A4,'Gruber Tabelle'!$A$7:$V$231,20,0)","v":0},{"$f":"VLOOKUP(A4,'Gruber Tabelle'!$A$7:$V$231,21,0)","v":0},{"$f":"VLOOKUP(A4,'Gruber Tabelle'!$A$7:$V$231,22,0)","v":0}]
[null,{"$f":"VLOOKUP(A5,'Gruber Tabelle'!$A$7:$V$231,2,0)","v":0},null,{"$f":"VLOOKUP(A5,'Gruber Tabelle'!$A$7:$V$231,3,0)","v":0},null,{"$f":"VLOOKUP(A5,'Gruber Tabelle'!$A$6:$V$231,4,0)","v":0},{"$f":"VLOOKUP(A5,'Gruber Tabelle'!$A$7:$V$231,5,0)","v":0},{"$f":"VLOOKUP(A5,'Gruber Tabelle'!$A$7:$V$231,6,0)","v":0},{"$f":"VLOOKUP(A5,'Gruber Tabelle'!$A$7:$V$231,7,0)","v":0},{"$f":"VLOOKUP(A5,'Gruber Tabelle'!$A$7:$V$231,8,0)","v":0},{"$f":"VLOOKUP(A5,'Gruber Tabelle'!$A$7:$V$231,9,0)","v":0},{"$f":"VLOOKUP(A5,'Gruber Tabelle'!$A$7:$V$231,10,0)","v":0},{"$f":"VLOOKUP(A5,'Gruber Tabelle'!$A$7:$V$231,11,0)","v":0},{"$f":"VLOOKUP(A5,'Gruber Tabelle'!$A$7:$V$231,12,0)","v":0},{"$f":"VLOOKUP(A5,'Gruber Tabelle'!$A$7:$V$231,13,0)","v":0},{"$f":"VLOOKUP(A5,'Gruber Tabelle'!$A$7:$V$231,14,0)","v":0},{"$f":"VLOOKUP(A5,'Gruber Tabelle'!$A$7:$V$231,15,0)","v":0},{"$f":"VLOOKUP(A5,'Gruber Tabelle'!$A$7:$V$231,16,0)","v":0},{"$f":"VLOOKUP(A5,'Gruber Tabelle'!$A$7:$V$231,17,0)","v":0},{"$f":"VLOOKUP(A5,'Gruber Tabelle'!$A$7:$V$231,18,0)","v":0},{"$f":"VLOOKUP(A5,'Gruber Tabelle'!$A$7:$V$231,19,0)","v":0},{"$f":"VLOOKUP(A5,'Gruber Tabelle'!$A$7:$V$231,20,0)","v":0},{"$f":"VLOOKUP(A5,'Gruber Tabelle'!$A$7:$V$231,21,0)","v":0},{"$f":"VLOOKUP(A5,'Gruber Tabelle'!$A$7:$V$231,22,0)","v":0}]
[null,{"$f":"VLOOKUP(A6,'Gruber Tabelle'!$A$7:$V$231,2,0)","v":0},null,{"$f":"VLOOKUP(A6,'Gruber Tabelle'!$A$7:$V$231,3,0)","v":0},null,{"$f":"VLOOKUP(A6,'Gruber Tabelle'!$A$6:$V$231,4,0)","v":0},{"$f":"VLOOKUP(A6,'Gruber Tabelle'!$A$7:$V$231,5,0)","v":0},{"$f":"VLOOKUP(A6,'Gruber Tabelle'!$A$7:$V$231,6,0)","v":0},{"$f":"VLOOKUP(A6,'Gruber Tabelle'!$A$7:$V$231,7,0)","v":0},{"$f":"VLOOKUP(A6,'Gruber Tabelle'!$A$7:$V$231,8,0)","v":0},{"$f":"VLOOKUP(A6,'Gruber Tabelle'!$A$7:$V$231,9,0)","v":0},{"$f":"VLOOKUP(A6,'Gruber Tabelle'!$A$7:$V$231,10,0)","v":0},{"$f":"VLOOKUP(A6,'Gruber Tabelle'!$A$7:$V$231,11,0)","v":0},{"$f":"VLOOKUP(A6,'Gruber Tabelle'!$A$7:$V$231,12,0)","v":0},{"$f":"VLOOKUP(A6,'Gruber Tabelle'!$A$7:$V$231,13,0)","v":0},{"$f":"VLOOKUP(A6,'Gruber Tabelle'!$A$7:$V$231,14,0)","v":0},{"$f":"VLOOKUP(A6,'Gruber Tabelle'!$A$7:$V$231,15,0)","v":0},{"$f":"VLOOKUP(A6,'Gruber Tabelle'!$A$7:$V$231,16,0)","v":0},{"$f":"VLOOKUP(A6,'Gruber Tabelle'!$A$7:$V$231,17,0)","v":0},{"$f":"VLOOKUP(A6,'Gruber Tabelle'!$A$7:$V$231,18,0)","v":0},{"$f":"VLOOKUP(A6,'Gruber Tabelle'!$A$7:$V$231,19,0)","v":0},{"$f":"VLOOKUP(A6,'Gruber Tabelle'!$A$7:$V$231,20,0)","v":0},{"$f":"VLOOKUP(A6,'Gruber Tabelle'!$A$7:$V$231,21,0)","v":0},{"$f":"VLOOKUP(A6,'Gruber Tabelle'!$A$7:$V$231,22,0)","v":0}]
{"$rows_left_out":31}
{"sheet":"Mengenberechnung","index":6,"n_rows":25,"n_cols":7,"rows_kept":25,"cut":false,"hidden":false,"merged":[[21,1,21,3],[21,5,24,6],[22,1,22,3],[23,1,23,3],[24,1,24,3],[17,1,17,3],[17,5,20,6],[18,1,18,3],[19,1,19,3],[20,1,20,3],[13,0,13,4],[14,1,14,3],[14,5,14,6],[15,1,15,3],[16,1,16,3],[9,1,9,3],[5,5,8,6],[9,5,12,6],[10,1,10,3],[11,1,11,3],[12,1,12,3],[4,1,4,3],[5,1,5,3],[6,1,6,3],[7,1,7,3],[8,1,8,3],[0,0,0,6],[1,0,1,4],[2,1,2,3],[2,5,2,6],[3,1,3,3]]}
[]
["Basis – Ration             Mischergröße",null,null,null,null,1000,"kg"]
["Kenn Nr.","Futtermittel",null,null,"kg."]
[{"$f":"Ration!A15","v":0},{"$f":"Ration!B15","v":0},null,null,{"$f":"IF(F2>0,F2*Ration!D15/1000,0)","v":0},"Tiere gesamt:",0]
[{"$f":"Ration!A16","v":0},{"$f":"Ration!B16","v":0},null,null,{"$f":"IF(F2>0,F2*Ration!D16/1000,0)","v":0},"kg je Tier/Tag:",0]
[{"$f":"Ration!A17","v":0},{"$f":"Ration!B17","v":0},null,null,{"$f":"IF(F2>0,F2*Ration!D17/1000,0)","v":0},"Die Mischung reicht für Tage :"]
{"$rows_left_out":20}
{"sheet":"Ausdruck","index":7,"n_rows":37,"n_cols":33,"rows_kept":37,"cut":false,"hidden":false,"merged":[[36,0,36,10],[36,11,36,21],[36,22,36,24],[35,22,35,24],[32,0,32,2],[33,0,33,2],[31,7,33,8],[34,0,34,10],[35,0,35,10],[35,11,35,21],[32,11,32,21],[31,11,31,21],[33,11,33,21],[34,11,34,21],[10,4,10,7],[11,4,11,7],[12,4,12,7],[25,0,25,10],[27,0,27,10],[7,1,7,3],[6,0,6,3],[4,0,4,3],[2,4,2,7],[3,4,3,7],[4,4,4,7],[5,4,5,7],[6,4,6,7],[7,4,7,7],[1,0,3,3],[1,4,1,10],[2,9,2,10],[3,9,3,10],[0,0,0,10],[7,9,7,10],[1,11,1,14],[2,11,2,14],[0,11,0,21],[30,0,30,10],[31,0,31,2],[5,9,5,10],[6,9,6,10],[4,9,4,10],[5,0,5,3],[9,0,9,3],[9,9,9,10],[8,0,8,1],[8,2,8,3],[8,9,8,10],[8,4,8,7],[9,4,9,7],[10,0,11,2],[10,3,11,3],[12,9,12,10],[10,9,10,10],[11,9,11,10],[12,0,12,3],[1,15,1,21],[6,11,6,14],[7,12,7,14],[8,11,8,12],[8,13,8,14],[9,11,9,14],[10,11,11,13],[10,14,11,14],[12,11,12,14],[12,15,12,18],[12,20,12,21],[29,11,29,21],[30,11,30,21],[11,15,11,18],[11,20,11,21],[9,15,9,18],[9,20,9,21],[10,15,10,18],[10,20,10,21],[7,15,7,18],[7,20,7,21],[8,15,8,18],[3,26,3,29],[4,22,4,25],[4,26,4,29],[1,22,1,25],[1,26,1,32],[2,22,2,25],[2,26,2,29],[2,31,2,32],[25,11,28,21],[8,20,8,21],[5,11,5,14],[5,15,5,18],[5,20,5,21],[6,15,6,18],[6,20,6,21],[3,15,3,18],[3,20,3,21],[4,11,4,14],[4,15,4,18],[4,20,4,21],[2,15,2,18],[2,20,2,21],[7,23,7,25],[7,26,7,29],[5,22,5,25],[5,26,5,29],[6,22,6,25],[6,26,6,29],[25,22,25,32],[33,22,33,32],[32,22,32,32],[12,22,12,25],[12,26,12,29],[29,22,29,32],[34,29,36,30],[34,22,34,24],[9,22,9,25],[9,26,9,29],[10,22,11,24],[10,25,11,25],[10,26,10,29],[11,26,11,29],[8,22,8,23],[8,24,8,25],[8,26,8,29]]}
[]
[null,null,null,null,{"$f":"Ration!B2","v":"Bitte Richtwerte auswählen  >>"},null,null,null,null,null,null,"Mischung 1",null,null,null,{"$f":"Ration!B2","v":"Bitte Richtwerte auswählen  >>"},null,null,null,null,null,null,"Grundfutter",null,null,null,{"$f":"Ration!B2","v":"Bitte Richtwerte auswählen  >>"}]
[null,null,null,null,"Futtermittelbezeichnung",null,null,null,"Anteil %","Mischungsanteil kg",null,"Ergänzung zur Grundration",null,null,null,"Futtermittelbezeichnung",null,null,null,"Anteil %","Mischungsanteil kg",null,"Gras, Silage, Heu usw.  + TF",null,null,null,"Futtermittelbezeichnung",null,null,null,"kg FM",{"$f":"Mengenberechnung!P16","v":0}]
[null,null,null,null,{"$f":"Ration!B15","v":0},null,null,null,{"$f":"Ration!C15","v":0},{"$f":"Mengenberechnung!E4","v":0},null,null,null,null,null,{"$f":"'Mischung 1'!B4","v":0},null,null,null,{"$f":"'Mischung 1'!C15","v":0},{"$f":"Mengenberechnung!E16","v":0},null,null,null,null,null,{"$f":"Grundfutter!B4","v":0},null,null,null,{"$f":"Grundfutter!D15","v":0}]
[{"$f":"Einstellung!C6","v":"Tierhaltungsschule"},null,null,null,{"$f":"Ration!B16","v":0},null,null,null,{"$f":"Ration!C16","v":0},{"$f":"Mengenberechnung!E5","v":0},null,{"$f":"Einstellung!C6","v":"Tierhaltungsschule"},null,null,null,{"$f":"'Mischung 1'!B5","v":0},null,null,null,{"$f":"'Mischung 1'!C16","v":0},{"$f":"Mengenberechnung!E17","v":0},null,{"$f":"Einstellung!C6","v":"Tierhaltungsschule"},null,null,null,{"$f":"Grundfutter!B5","v":0},null,null,null,{"$f":"Grundfutter!D16","v":0}]
[{"$f":"Einstellung!E6","v":"Triesdorf"},null,null,null,{"$f":"Ration!B17","v":0},null,null,null,{"$f":"Ration!C17","v":0},{"$f":"Mengenberechnung!E6","v":0},null,{"$f":"Einstellung!E6","v":"Triesdorf"},null,null,null,{"$f":"'Mischung 1'!B6","v":0},null,null,null,{"$f":"'Mischung 1'!C17","v":0},{"$f":"Mengenberechnung!E18","v":0},null,{"$f":"Einstellung!E6","v":"Triesdorf"},null,null,null,{"$f":"Grundfutter!B6","v":0},null,null,null,{"$f":"Grundfutter!D17","v":0}]
{"$rows_left_out":31}