{"text_format":"1","workbook":"xlsx","n_sheets":8,"sheets":["Einstellung","Sollwerte","Ration","Mischung 1","Mischung 2","Gruber Tabelle","Mengenberechnung","Ausdruck"],"not_rendered":{"charts":0,"images":17,"macros":1,"external_links":0,"defined_names":4,"comments":2,"pivot_tables":0},"unopened":[],"bounds":{"document_bytes":16777216,"sheet_cells":100000,"rows_first":2000,"rows_last":500,"rows_between":2000,"halvings":0,"cell_chars":16384,"cell_head_chars":4096},"cells_cut":0,"cells_raw":0,"read":"whole","date_system":"1900"}

{"sheet":"Einstellung","index":0,"n_rows":17,"n_cols":6,"rows_kept":17,"cut":false,"hidden":false,"merged":[[1,1,1,16],[15,1,15,4],[16,1,16,4],[4,5,23,16],[6,2,6,4],[7,1,7,4],[10,1,10,4],[11,1,11,4],[12,1,12,4],[13,1,13,4],[2,5,2,16],[3,5,3,16],[2,1,3,4],[14,1,14,4],[8,1,9,4],[24,1,24,12],[4,3,4,4],[4,1,4,2],[5,1,5,4]]}
[]
[]
[null,"Adressfelder bitte bearbeiten. Diese sind zur Dokumentation von Futtermischungen nötig.",null,null,null,"Futterberechnung zur Fütterung in der Rindermast"]
[null,null,null,null,null,"Gruber Tabelle, 28. Auflage / Januar 2024        www.LfL.bayern.de"]
[null,"Tierhaltungsschule",null,"Triesdorf"]
[null,"Markgrafenstraße 12"]
[null,91746,"Weidenbach"]
[null,"09 111 111 1111"]
{"$rows_left_out":10}
{"sheet":"Sollwerte","index":1,"n_rows":80,"n_cols":16,"rows_kept":80,"cut":false,"hidden":false,"merged":[[1,1,2,13],[0,1,0,13]]}
[]
[null,"Richtwerte zur Futteraufnahme (TM-Tag) , Empfehlungen zur Energieversorgung (MJ ME) und Rohproteinversorgung (XP) pro Tag"]
[]
[null,"Tiere zur Mast","Kenn - Nr.","TM g","aNDF %","XP g","XP/kg TM","ME/MJ","ME/kgTM"," Ca g","P g","Mg g","Na g","K g","LM","Faktor"]
[null,"Bitte Sollwerte auswählen  !!!",0,0,null,0,null,0,null,0,0,0,0,0,null,"zur Ber. von pabKH und NDF"]
[null,"Fresserfütterung  LM 100  - mittl. ZN 1000 g  ",1,1700,25,264,152,20.399999999999999,11.77,16.600000000000001,7.7,3,2.5,17.5,100,{"$f":"IF(O6>0,700^0.62/O6^0.62,0)","v":3.3416486480802288}]
[null,"Fresserfütterung  LM 100  - mittl. ZN 1150 g ",2,1800,25,296,162,22.5,12.3,18.5,8.6,3.3,2.8,18.5,100,{"$f":"IF(O7>0,700^0.62/O7^0.62,0)","v":3.3416486480802288}]
[null,"Fresserfütterung  LM 100  - mittl. ZN 1300 g ",3,1900,25,330,171,24.7,12.78,20.399999999999999,9.5,3.6,3,19.5,100,3.3416486480802288]
{"$rows_left_out":73}
{"sheet":"Ration","index":2,"n_rows":35,"n_cols":18,"rows_kept":35,"cut":false,"hidden":false,"merged":[[29,0,30,2],[25,0,25,2],[26,0,26,2],[0,0,0,16],[24,0,24,2],[28,0,28,2],[27,0,27,2],[1,0,1,4],[1,6,1,16],[3,5,12,5]]}
[]
["Bitte Sollwerte auswählen  !!!"]
["Nr ","Futterart","TM %","TM g","FM kg Ration",null,"aNDF om g","Rohprotein g","ME MJ","XS+XZ","bXS","Ca","P","Mg","Na","K","Preis / dt FM","Typ"]
[null,{"$f":"IFERROR(VLOOKUP(A4,'Gruber Tabelle'!$A$6:$U$336,2,0),0)","v":0},{"$f":"IFERROR(VLOOKUP(A4,'Gruber Tabelle'!$A$6:$U$336,3,0)/1000,0)","v":0},{"$f":"IFERROR(VLOOKUP(A4,'Gruber Tabelle'!$A$6:$U$336,3,0),0)","v":0},{"$f":"IFERROR(F15/C15,0)","v":0},"in 1000 g Trockenmasse",{"$f":"IFERROR(VLOOKUP(A4,'Gruber Tabelle'!$A$6:$U$336,5,0),0)","v":0},{"$f":"IFERROR(VLOOKUP(A4,'Gruber Tabelle'!$A$6:$U$336,7,0),0)","v":0},{"$f":"IFERROR(VLOOKUP(A4,'Gruber Tabelle'!$A$6:$U$336,12,0),0)","v":0},{"$f":"IFERROR(VLOOKUP(A4,'Gruber Tabelle'!$A$6:$U$336,13,0),0)","v":0},{"$f":"IFERROR(VLOOKUP(A4,'Gruber Tabelle'!$A$6:$U$336,14,0),0)","v":0},{"$f":"IFERROR(VLOOKUP(A4,'Gruber Tabelle'!$A$6:$U$336,16,0),0)","v":0},{"$f":"IFERROR(VLOOKUP(A4,'Gruber Tabelle'!$A$6:$U$336,17,0),0)","v":0},{"$f":"IFERROR(VLOOKUP(A4,'Gruber Tabelle'!$A$6:$U$336,18,0),0)","v":0},{"$f":"IFERROR(VLOOKUP(A4,'Gruber Tabelle'!$A$6:$U$336,19,0),0)","v":0},{"$f":"IFERROR(VLOOKUP(A4,'Gruber Tabelle'!$A$6:$U$336,20,0),0)","v":0},{"$f":"IFERROR(VLOOKUP(A4,'Gruber Tabelle'!$A$6:$U$336,21,0),0)","v":0},{"$f":"IFERROR(VLOOKUP(A4,'Gruber Tabelle'!$A$6:$V$336,22,0),0)","v":0}]
[null,{"$f":"IFERROR(VLOOKUP(A5,'Gruber Tabelle'!$A$6:$U$336,2,0),0)","v":0},{"$f":"IFERROR(VLOOKUP(A5,'Gruber Tabelle'!$A$6:$U$336,3,0)/1000,0)","v":0},{"$f":"IFERROR(VLOOKUP(A5,'Gruber Tabelle'!$A$6:$U$336,3,0),0)","v":0},0,null,{"$f":"IFERROR(VLOOKUP(A5,'Gruber Tabelle'!$A$6:$U$336,5,0),0)","v":0},{"$f":"IFERROR(VLOOKUP(A5,'Gruber Tabelle'!$A$6:$U$336,7,0),0)","v":0},{"$f":"IFERROR(VLOOKUP(A5,'Gruber Tabelle'!$A$6:$U$336,12,0),0)","v":0},{"$f":"IFERROR(VLOOKUP(A5,'Gruber Tabelle'!$A$6:$U$336,13,0),0)","v":0},{"$f":"IFERROR(VLOOKUP(A5,'Gruber Tabelle'!$A$6:$U$336,14,0),0)","v":0},{"$f":"IFERROR(VLOOKUP(A5,'Gruber Tabelle'!$A$6:$U$336,16,0),0)","v":0},{"$f":"IFERROR(VLOOKUP(A5,'Gruber Tabelle'!$A$6:$U$336,17,0),0)","v":0},{"$f":"IFERROR(VLOOKUP(A5,'Gruber Tabelle'!$A$6:$U$336,18,0),0)","v":0},{"$f":"IFERROR(VLOOKUP(A5,'Gruber Tabelle'!$A$6:$U$336,19,0),0)","v":0},{"$f":"IFERROR(VLOOKUP(A5,'Gruber Tabelle'!$A$6:$U$336,20,0),0)","v":0},{"$f":"IFERROR(VLOOKUP(A5,'Gruber Tabelle'!$A$6:$U$336,21,0),0)","v":0},{"$f":"IFERROR(VLOOKUP(A5,'Gruber Tabelle'!$A$6:$V$336,22,0),0)","v":0}]
[null,{"$f":"IFERROR(VLOOKUP(A6,'Gruber Tabelle'!$A$6:$U$336,2,0),0)","v":0},{"$f":"IFERROR(VLOOKUP(A6,'Gruber Tabelle'!$A$6:$U$336,3,0)/1000,0)","v":0},{"$f":"IFERROR(VLOOKUP(A6,'Gruber Tabelle'!$A$6:$U$336,3,0),0)","v":0},0,null,{"$f":"IFERROR(VLOOKUP(A6,'Gruber Tabelle'!$A$6:$U$336,5,0),0)","v":0},{"$f":"IFERROR(VLOOKUP(A6,'Gruber Tabelle'!$A$6:$U$336,7,0),0)","v":0},{"$f":"IFERROR(VLOOKUP(A6,'Gruber Tabelle'!$A$6:$U$336,12,0),0)","v":0},{"$f":"IFERROR(VLOOKUP(A6,'Gruber Tabelle'!$A$6:$U$336,13,0),0)","v":0},{"$f":"IFERROR(VLOOKUP(A6,'Gruber Tabelle'!$A$6:$U$336,14,0),0)","v":0},{"$f":"IFERROR(VLOOKUP(A6,'Gruber Tabelle'!$A$6:$U$336,16,0),0)","v":0},{"$f":"IFERROR(VLOOKUP(A6,'Gruber Tabelle'!$A$6:$U$336,17,0),0)","v":0},{"$f":"IFERROR(VLOOKUP(A6,'Gruber Tabelle'!$A$6:$U$336,18,0),0)","v":0},{"$f":"IFERROR(VLOOKUP(A6,'Gruber Tabelle'!$A$6:$U$336,19,0),0)","v":0},{"$f":"IFERROR(VLOOKUP(A6,'Gruber Tabelle'!$A$6:$U$336,20,0),0)","v":0},{"$f":"IFERROR(VLOOKUP(A6,'Gruber Tabelle'!$A$6:$U$336,21,0),0)","v":0},{"$f":"IFERROR(VLOOKUP(A6,'Gruber Tabelle'!$A$6:$V$336,22,0),0)","v":0}]
[null,{"$f":"IFERROR(VLOOKUP(A7,'Gruber Tabelle'!$A$6:$U$336,2,0),0)","v":0},{"$f":"IFERROR(VLOOKUP(A7,'Gruber Tabelle'!$A$6:$U$336,3,0)/1000,0)","v":0},{"$f":"IFERROR(VLOOKUP(A7,'Gruber Tabelle'!$A$6:$U$336,3,0),0)","v":0},0,null,{"$f":"IFERROR(VLOOKUP(A7,'Gruber Tabelle'!$A$6:$U$336,5,0),0)","v":0},{"$f":"IFERROR(VLOOKUP(A7,'Gruber Tabelle'!$A$6:$U$336,7,0),0)","v":0},{"$f":"IFERROR(VLOOKUP(A7,'Gruber Tabelle'!$A$6:$U$336,12,0),0)","v":0},{"$f":"IFERROR(VLOOKUP(A7,'Gruber Tabelle'!$A$6:$U$336,13,0),0)","v":0},{"$f":"IFERROR(VLOOKUP(A7,'Gruber Tabelle'!$A$6:$U$336,14,0),0)","v":0},{"$f":"IFERROR(VLOOKUP(A7,'Gruber Tabelle'!$A$6:$U$336,16,0),0)","v":0},{"$f":"IFERROR(VLOOKUP(A7,'Gruber Tabelle'!$A$6:$U$336,17,0),0)","v":0},{"$f":"IFERROR(VLOOKUP(A7,'Gruber Tabelle'!$A$6:$U$336,18,0),0)","v":0},{"$f":"IFERROR(VLOOKUP(A7,'Gruber Tabelle'!$A$6:$U$336,19,0),0)","v":0},{"$f":"IFERROR(VLOOKUP(A7,'Gruber Tabelle'!$A$6:$U$336,20,0),0)","v":0},{"$f":"IFERROR(VLOOKUP(A7,'Gruber Tabelle'!$A$6:$U$336,21,0),0)","v":0},{"$f":"IFERROR(VLOOKUP(A7,'Gruber Tabelle'!$A$6:$V$336,22,0),0)","v":0}]
[null,{"$f":"IFERROR(VLOOKUP(A8,'Gruber Tabelle'!$A$6:$U$336,2,0),0)","v":0},{"$f":"IFERROR(VLOOKUP(A8,'Gruber Tabelle'!$A$6:$U$336,3,0)/1000,0)","v":0},{"$f":"IFERROR(VLOOKUP(A8,'Gruber Tabelle'!$A$6:$U$336,3,0),0)","v":0},0,null,{"$f":"IFERROR(VLOOKUP(A8,'Gruber Tabelle'!$A$6:$U$336,5,0),0)","v":0},{"$f":"IFERROR(VLOOKUP(A8,'Gruber Tabelle'!$A$6:$U$336,7,0),0)","v":0},{"$f":"IFERROR(VLOOKUP(A8,'Gruber Tabelle'!$A$6:$U$336,12,0),0)","v":0},{"$f":"IFERROR(VLOOKUP(A8,'Gruber Tabelle'!$A$6:$U$336,13,0),0)","v":0},{"$f":"IFERROR(VLOOKUP(A8,'Gruber Tabelle'!$A$6:$U$336,14,0),0)","v":0},{"$f":"IFERROR(VLOOKUP(A8,'Gruber Tabelle'!$A$6:$U$336,16,0),0)","v":0},{"$f":"IFERROR(VLOOKUP(A8,'Gruber Tabelle'!$A$6:$U$336,17,0),0)","v":0},{"$f":"IFERROR(VLOOKUP(A8,'Gruber Tabelle'!$A$6:$U$336,18,0),0)","v":0},{"$f":"IFERROR(VLOOKUP(A8,'Gruber Tabelle'!$A$6:$U$336,19,0),0)","v":0},{"$f":"IFERROR(VLOOKUP(A8,'Gruber Tabelle'!$A$6:$U$336,20,0),0)","v":0},{"$f":"IFERROR(VLOOKUP(A8,'Gruber Tabelle'!$A$6:$U$336,21,0),0)","v":0},{"$f":"IFERROR(VLOOKUP(A8,'Gruber Tabelle'!$A$6:$V$336,22,0),0)","v":0}]
{"$rows_left_out":28}
{"sheet":"Mischung 1","index":3,"n_rows":26,"n_cols":16,"rows_kept":26,"cut":false,"hidden":false,"merged":[[24,0,24,1],[25,0,25,3],[0,0,0,15],[1,0,1,4],[1,5,1,15],[3,2,12,4],[2,2,2,4]]}
[]
[]
["Nr ","Futterart","Kraftfutter",null,null,"aNDFom g","XP g","ME MJ","XS+XZ","bXS","Ca","P","Mg","Na","K","Preis / dt FM"]
[null,{"$f":"IFERROR(VLOOKUP(A4,'Gruber Tabelle'!$A$6:$U$336,2,0),0)","v":0},"%",null,null,{"$f":"IFERROR(VLOOKUP(A4,'Gruber Tabelle'!$A$6:$U$336,5,0),0)","v":0},{"$f":"IFERROR(VLOOKUP(A4,'Gruber Tabelle'!$A$6:$U$336,7,0),0)","v":0},{"$f":"IFERROR(VLOOKUP(A4,'Gruber Tabelle'!$A$6:$U$336,12,0),0)","v":0},{"$f":"IFERROR(VLOOKUP(A4,'Gruber Tabelle'!$A$6:$U$336,13,0),0)","v":0},{"$f":"IFERROR(VLOOKUP(A4,'Gruber Tabelle'!$A$6:$U$336,14,0),0)","v":0},{"$f":"IFERROR(VLOOKUP(A4,'Gruber Tabelle'!$A$6:$U$336,16,0),0)","v":0},{"$f":"IFERROR(VLOOKUP(A4,'Gruber Tabelle'!$A$6:$U$336,17,0),0)","v":0},{"$f":"IFERROR(VLOOKUP(A4,'Gruber Tabelle'!$A$6:$U$336,18,0),0)","v":0},{"$f":"IFERROR(VLOOKUP(A4,'Gruber Tabelle'!$A$6:$U$336,19,0),0)","v":0},{"$f":"IFERROR(VLOOKUP(A4,'Gruber Tabelle'!$A$6:$U$336,20,0),0)","v":0},{"$f":"IFERROR(VLOOKUP(A4,'Gruber Tabelle'!$A$6:$U$336,21,0),0)","v":0}]
[null,{"$f":"IFERROR(VLOOKUP(A5,'Gruber Tabelle'!$A$6:$U$336,2,0),0)","v":0},null,null,null,{"$f":"IFERROR(VLOOKUP(A5,'Gruber Tabelle'!$A$6:$U$336,5,0),0)","v":0},{"$f":"IFERROR(VLOOKUP(A5,'Gruber Tabelle'!$A$6:$U$336,7,0),0)","v":0},{"$f":"IFERROR(VLOOKUP(A5,'Gruber Tabelle'!$A$6:$U$336,12,0),0)","v":0},{"$f":"IFERROR(VLOOKUP(A5,'Gruber Tabelle'!$A$6:$U$336,13,0),0)","v":0},{"$f":"IFERROR(VLOOKUP(A5,'Gruber Tabelle'!$A$6:$U$336,14,0),0)","v":0},{"$f":"IFERROR(VLOOKUP(A5,'Gruber Tabelle'!$A$6:$U$336,16,0),0)","v":0},{"$f":"IFERROR(VLOOKUP(A5,'Gruber Tabelle'!$A$6:$U$336,17,0),0)","v":0},{"$f":"IFERROR(VLOOKUP(A5,'Gruber Tabelle'!$A$6:$U$336,18,0),0)","v":0},{"$f":"IFERROR(VLOOKUP(A5,'Gruber Tabelle'!$A$6:$U$336,19,0),0)","v":0},{"$f":"IFERROR(VLOOKUP(A5,'Gruber Tabelle'!$A$6:$U$336,20,0),0)","v":0},{"$f":"IFERROR(VLOOKUP(A5,'Gruber Tabelle'!$A$6:$U$336,21,0),0)","v":0}]
[null,{"$f":"IFERROR(VLOOKUP(A6,'Gruber Tabelle'!$A$6:$U$336,2,0),0)","v":0},null,null,null,{"$f":"IFERROR(VLOOKUP(A6,'Gruber Tabelle'!$A$6:$U$336,5,0),0)","v":0},{"$f":"IFERROR(VLOOKUP(A6,'Gruber Tabelle'!$A$6:$U$336,7,0),0)","v":0},{"$f":"IFERROR(VLOOKUP(A6,'Gruber Tabelle'!$A$6:$U$336,12,0),0)","v":0},{"$f":"IFERROR(VLOOKUP(A6,'Gruber Tabelle'!$A$6:$U$336,13,0),0)","v":0},{"$f":"IFERROR(VLOOKUP(A6,'Gruber Tabelle'!$A$6:$U$336,14,0),0)","v":0},{"$f":"IFERROR(VLOOKUP(A6,'Gruber Tabelle'!$A$6:$U$336,16,0),0)","v":0},{"$f":"IFERROR(VLOOKUP(A6,'Gruber Tabelle'!$A$6:$U$336,17,0),0)","v":0},{"$f":"IFERROR(VLOOKUP(A6,'Gruber Tabelle'!$A$6:$U$336,18,0),0)","v":0},{"$f":"IFERROR(VLOOKUP(A6,'Gruber Tabelle'!$A$6:$U$336,19,0),0)","v":0},{"$f":"IFERROR(VLOOKUP(A6,'Gruber Tabelle'!$A$6:$U$336,20,0),0)","v":0},{"$f":"IFERROR(VLOOKUP(A6,'Gruber Tabelle'!$A$6:$U$336,21,0),0)","v":0}]
[null,{"$f":"IFERROR(VLOOKUP(A7,'Gruber Tabelle'!$A$6:$U$336,2,0),0)","v":0},null,null,null,{"$f":"IFERROR(VLOOKUP(A7,'Gruber Tabelle'!$A$6:$U$336,5,0),0)","v":0},{"$f":"IFERROR(VLOOKUP(A7,'Gruber Tabelle'!$A$6:$U$336,7,0),0)","v":0},{"$f":"IFERROR(VLOOKUP(A7,'Gruber Tabelle'!$A$6:$U$336,12,0),0)","v":0},{"$f":"IFERROR(VLOOKUP(A7,'Gruber Tabelle'!$A$6:$U$336,13,0),0)","v":0},{"$f":"IFERROR(VLOOKUP(A7,'Gruber Tabelle'!$A$6:$U$336,14,0),0)","v":0},{"$f":"IFERROR(VLOOKUP(A7,'Gruber Tabelle'!$A$6:$U$336,16,0),0)","v":0},{"$f":"IFERROR(VLOOKUP(A7,'Gruber Tabelle'!$A$6:$U$336,17,0),0)","v":0},{"$f":"IFERROR(VLOOKUP(A7,'Gruber Tabelle'!$A$6:$U$336,18,0),0)","v":0},{"$f":"IFERROR(VLOOKUP(A7,'Gruber Tabelle'!$A$6:$U$336,19,0),0)","v":0},{"$f":"IFERROR(VLOOKUP(A7,'Gruber Tabelle'!$A$6:$U$336,20,0),0)","v":0},{"$f":"IFERROR(VLOOKUP(A7,'Gruber Tabelle'!$A$6:$U$336,21,0),0)","v":0}]
[null,{"$f":"IFERROR(VLOOKUP(A8,'Gruber Tabelle'!$A$6:$U$336,2,0),0)","v":0},null,null,null,{"$f":"IFERROR(VLOOKUP(A8,'Gruber Tabelle'!$A$6:$U$336,5,0),0)","v":0},{"$f":"IFERROR(VLOOKUP(A8,'Gruber Tabelle'!$A$6:$U$336,7,0),0)","v":0},{"$f":"IFERROR(VLOOKUP(A8,'Gruber Tabelle'!$A$6:$U$336,12,0),0)","v":0},{"$f":"IFERROR(VLOOKUP(A8,'Gruber Tabelle'!$A$6:$U$336,13,0),0)","v":0},{"$f":"IFERROR(VLOOKUP(A8,'Gruber Tabelle'!$A$6:$U$336,14,0),0)","v":0},{"$f":"IFERROR(VLOOKUP(A8,'Gruber Tabelle'!$A$6:$U$336,16,0),0)","v":0},{"$f":"IFERROR(VLOOKUP(A8,'Gruber Tabelle'!$A$6:$U$336,17,0),0)","v":0},{"$f":"IFERROR(VLOOKUP(A8,'Gruber Tabelle'!$A$6:$U$336,18,0),0)","v":0},{"$f":"IFERROR(VLOOKUP(A8,'Gruber Tabelle'!$A$6:$U$336,19,0),0)","v":0},{"$f":"IFERROR(VLOOKUP(A8,'Gruber Tabelle'!$A$6:$U$336,20,0),0)","v":0},{"$f":"IFERROR(VLOOKUP(A8,'Gruber Tabelle'!$A$6:$U$336,21,0),0)","v":0}]
{"$rows_left_out":19}
{"sheet":"Mischung 2","index":4,"n_rows":26,"n_cols":16,"rows_kept":26,"cut":false,"hidden":false,"merged":[[25,0,25,3],[24,0,24,1],[0,0,0,15],[1,0,1,4],[1,5,1,15],[3,2,12,4],[2,2,2,4]]}
[]
[]
["Nr ","Futterart","Kraftfutter",null,null,"aNDFom g","XP g","ME Mj","XS+XZ","bXS","Ca","P","Mg","Na","K","Preis / dt FM"]
[null,{"$f":"IFERROR(VLOOKUP(A4,'Gruber Tabelle'!$A$6:$U$336,2,0),0)","v":0},null,null,null,{"$f":"IFERROR(VLOOKUP(A4,'Gruber Tabelle'!$A$6:$U$336,5,0),0)","v":0},{"$f":"IFERROR(VLOOKUP(A4,'Gruber Tabelle'!$A$6:$U$336,7,0),0)","v":0},{"$f":"IFERROR(VLOOKUP(A4,'Gruber Tabelle'!$A$6:$U$336,12,0),0)","v":0},{"$f":"IFERROR(VLOOKUP(A4,'Gruber Tabelle'!$A$6:$U$336,13,0),0)","v":0},{"$f":"IFERROR(VLOOKUP(A4,'Gruber Tabelle'!$A$6:$U$336,14,0),0)","v":0},{"$f":"IFERROR(VLOOKUP(A4,'Gruber Tabelle'!$A$6:$U$336,16,0),0)","v":0},{"$f":"IFERROR(VLOOKUP(A4,'Gruber Tabelle'!$A$6:$U$336,17,0),0)","v":0},{"$f":"IFERROR(VLOOKUP(A4,'Gruber Tabelle'!$A$6:$U$336,18,0),0)","v":0},{"$f":"IFERROR(VLOOKUP(A4,'Gruber Tabelle'!$A$6:$U$336,19,0),0)","v":0},{"$f":"IFERROR(VLOOKUP(A4,'Gruber Tabelle'!$A$6:$U$336,20,0),0)","v":0},{"$f":"IFERROR(VLOOKUP(A4,'Gruber Tabelle'!$A$6:$U$336,21,0),0)","v":0}]
[null,{"$f":"IFERROR(VLOOKUP(A5,'Gruber Tabelle'!$A$6:$U$336,2,0),0)","v":0},null,null,null,{"$f":"IFERROR(VLOOKUP(A5,'Gruber Tabelle'!$A$6:$U$336,5,0),0)","v":0},{"$f":"IFERROR(VLOOKUP(A5,'Gruber Tabelle'!$A$6:$U$336,7,0),0)","v":0},{"$f":"IFERROR(VLOOKUP(A5,'Gruber Tabelle'!$A$6:$U$336,12,0),0)","v":0},{"$f":"IFERROR(VLOOKUP(A5,'Gruber Tabelle'!$A$6:$U$336,13,0),0)","v":0},{"$f":"IFERROR(VLOOKUP(A5,'Gruber Tabelle'!$A$6:$U$336,14,0),0)","v":0},{"$f":"IFERROR(VLOOKUP(A5,'Gruber Tabelle'!$A$6:$U$336,16,0),0)","v":0},{"$f":"IFERROR(VLOOKUP(A5,'Gruber Tabelle'!$A$6:$U$336,17,0),0)","v":0},{"$f":"IFERROR(VLOOKUP(A5,'Gruber Tabelle'!$A$6:$U$336,18,0),0)","v":0},{"$f":"IFERROR(VLOOKUP(A5,'Gruber Tabelle'!$A$6:$U$336,19,0),0)","v":0},{"$f":"IFERROR(VLOOKUP(A5,'Gruber Tabelle'!$A$6:$U$336,20,0),0)","v":0},{"$f":"IFERROR(VLOOKUP(A5,'Gruber Tabelle'!$A$6:$U$336,21,0),0)","v":0}]
[null,{"$f":"IFERROR(VLOOKUP(A6,'Gruber Tabelle'!$A$6:$U$336,2,0),0)","v":0},null,null,null,{"$f":"IFERROR(VLOOKUP(A6,'Gruber Tabelle'!$A$6:$U$336,5,0),0)","v":0},{"$f":"IFERROR(VLOOKUP(A6,'Gruber Tabelle'!$A$6:$U$336,7,0),0)","v":0},{"$f":"IFERROR(VLOOKUP(A6,'Gruber Tabelle'!$A$6:$U$336,12,0),0)","v":0},{"$f":"IFERROR(VLOOKUP(A6,'Gruber Tabelle'!$A$6:$U$336,13,0),0)","v":0},{"$f":"IFERROR(VLOOKUP(A6,'Gruber Tabelle'!$A$6:$U$336,14,0),0)","v":0},{"$f":"IFERROR(VLOOKUP(A6,'Gruber Tabelle'!$A$6:$U$336,16,0),0)","v":0},{"$f":"IFERROR(VLOOKUP(A6,'Gruber Tabelle'!$A$6:$U$336,17,0),0)","v":0},{"$f":"IFERROR(VLOOKUP(A6,'Gruber Tabelle'!$A$6:$U$336,18,0),0)","v":0},{"$f":"IFERROR(VLOOKUP(A6,'Gruber Tabelle'!$A$6:$U$336,19,0),0)","v":0},{"$f":"IFERROR(VLOOKUP(A6,'Gruber Tabelle'!$A$6:$U$336,20,0),0)","v":0},{"$f":"IFERROR(VLOOKUP(A6,'Gruber Tabelle'!$A$6:$U$336,21,0),0)","v":0}]
[null,{"$f":"IFERROR(VLOOKUP(A7,'Gruber Tabelle'!$A$6:$U$336,2,0),0)","v":0},null,null,null,{"$f":"IFERROR(VLOOKUP(A7,'Gruber Tabelle'!$A$6:$U$336,5,0),0)","v":0},{"$f":"IFERROR(VLOOKUP(A7,'Gruber Tabelle'!$A$6:$U$336,7,0),0)","v":0},{"$f":"IFERROR(VLOOKUP(A7,'Gruber Tabelle'!$A$6:$U$336,12,0),0)","v":0},{"$f":"IFERROR(VLOOKUP(A7,'Gruber Tabelle'!$A$6:$U$336,13,0),0)","v":0},{"$f":"IFERROR(VLOOKUP(A7,'Gruber Tabelle'!$A$6:$U$336,14,0),0)","v":0},{"$f":"IFERROR(VLOOKUP(A7,'Gruber Tabelle'!$A$6:$U$336,16,0),0)","v":0},{"$f":"IFERROR(VLOOKUP(A7,'Gruber Tabelle'!$A$6:$U$336,17,0),0)","v":0},{"$f":"IFERROR(VLOOKUP(A7,'Gruber Tabelle'!$A$6:$U$336,18,0),0)","v":0},{"$f":"IFERROR(VLOOKUP(A7,'Gruber Tabelle'!$A$6:$U$336,19,0),0)","v":0},{"$f":"IFERROR(VLOOKUP(A7,'Gruber Tabelle'!$A$6:$U$336,20,0),0)","v":0},{"$f":"IFERROR(VLOOKUP(A7,'Gruber Tabelle'!$A$6:$U$336,21,0),0)","v":0}]
[null,{"$f":"IFERROR(VLOOKUP(A8,'Gruber Tabelle'!$A$6:$U$336,2,0),0)","v":0},null,null,null,{"$f":"IFERROR(VLOOKUP(A8,'Gruber Tabelle'!$A$6:$U$336,5,0),0)","v":0},{"$f":"IFERROR(VLOOKUP(A8,'Gruber Tabelle'!$A$6:$U$336,7,0),0)","v":0},{"$f":"IFERROR(VLOOKUP(A8,'Gruber Tabelle'!$A$6:$U$336,12,0),0)","v":0},{"$f":"IFERROR(VLOOKUP(A8,'Gruber Tabelle'!$A$6:$U$336,13,0),0)","v":0},{"$f":"IFERROR(VLOOKUP(A8,'Gruber Tabelle'!$A$6:$U$336,14,0),0)","v":0},{"$f":"IFERROR(VLOOKUP(A8,'Gruber Tabelle'!$A$6:$U$336,16,0),0)","v":0},{"$f":"IFERROR(VLOOKUP(A8,'Gruber Tabelle'!$A$6:$U$336,17,0),0)","v":0},{"$f":"IFERROR(VLOOKUP(A8,'Gruber Tabelle'!$A$6:$U$336,18,0),0)","v":0},{"$f":"IFERROR(VLOOKUP(A8,'Gruber Tabelle'!$A$6:$U$336,19,0),0)","v":0},{"$f":"IFERROR(VLOOKUP(A8,'Gruber Tabelle'!$A$6:$U$336,20,0),0)","v":0},{"$f":"IFERROR(VLOOKUP(A8,'Gruber Tabelle'!$A$6:$U$336,21,0),0)","v":0}]
{"$rows_left_out":19}
{"sheet":"Gruber Tabelle","index":5,"n_rows":336,"n_cols":22,"rows_kept":336,"cut":false,"hidden":false,"merged":[[3,21,4,21],[1,7,1,21],[0,0,0,21],[1,2,1,6],[1,0,4,1],[2,3,2,19]]}
["Mischung 1"]
[null,null,"www.LfL.bayern.de",null,null,null,null,"Gruber Tabelle zur Fütterung in der Rindermast      - Fresser - Mastfärsen - Bullen - Mastkühe - Ochsen"]
[null,null,null,"in 1000 g Trockenmasse TM",null,null,null,null,null,null,null,null,null,null,null,null,null,null,null,null,"Preis","Typ"]
[null,null,"TM","XF","aNDF","ADF","XP","nXP","UDP","RNB","Nel","ME","XS+XZ","bXS","XL","Ca","P","Mg","Na","K","FM"]
[null,null,"g","g","om  g","om  g","g","g","%","g","MJ","MJ","g","g","g","g","g","g","g","g","€ / dt"]
[null," 7.1 Grünfutter",null,null,null,null,null,null,null,{"$f":"(G6-H6)/6.25","v":0}]
[null,"Wiesengras 1. Schnitt",null,null,null,null,null,null,null,0]
[1013,"Wiesengr. 1. S. Blattstadium",175,173,433,209,228,154,10,11.84,7.12,11.57,137,null,33,6.9,3.8,2.4,0.9,32,null,"GF"]
{"$rows_left_out":329}
{"sheet":"Mengenberechnung","index":6,"n_rows":39,"n_cols":8,"rows_kept":39,"cut":false,"hidden":false,"merged":[[35,2,35,4],[35,6,38,7],[36,2,36,4],[37,2,37,4],[38,2,38,4],[31,6,34,7],[32,2,32,4],[33,2,33,4],[34,2,34,4],[23,2,23,4],[23,6,26,7],[24,2,24,4],[25,2,25,4],[26,2,26,4],[27,1,27,5],[28,2,28,4],[28,6,28,7],[29,2,29,4],[30,2,30,4],[31,2,31,4],[19,2,19,4],[19,6,22,7],[20,2,20,4],[21,2,21,4],[22,2,22,4],[15,1,15,5],[16,2,16,4],[16,6,16,7],[17,2,17,4],[18,2,18,4],[10,2,10,4],[10,6,14,7],[11,2,11,4],[12,2,12,4],[13,2,13,4],[14,2,14,4],[0,1,0,7],[1,1,1,5],[2,2,2,4],[2,6,2,7],[3,2,3,4],[3,6,9,7],[4,2,4,4],[5,2,5,4],[6,2,6,4],[7,2,7,4],[8,2,8,4],[9,2,9,4]]}
[]
[null,"Basis – Ration für :",null,null,null,null,0,"Tiere"]
[null,"Kenn Nr.","Futtermittel",null,null,"kg."]
[null,{"$f":"Ration!A15","v":0},{"$f":"Ration!B15","v":0},null,null,{"$f":"IF(Ration!F15>0,$G$2*Ration!E4,0)","v":0},"Gesamtgewicht Grundfutter und Kraftfutter pro Mischung in kg:"]
[null,{"$f":"Ration!A16","v":0},{"$f":"Ration!B16","v":0},null,null,{"$f":"IF(Ration!F16>0,$G$2*Ration!E5,0)","v":0}]
[null,{"$f":"Ration!A17","v":0},{"$f":"Ration!B17","v":0},null,null,{"$f":"IF(Ration!F17>0,$G$2*Ration!E6,0)","v":0}]
[null,{"$f":"Ration!A18","v":0},{"$f":"Ration!B18","v":0},null,null,{"$f":"IF(Ration!F18>0,$G$2*Ration!E7,0)","v":0}]
[null,{"$f":"Ration!A19","v":0},{"$f":"Ration!B19","v":0},null,null,{"$f":"IF(Ration!F19>0,$G$2*Ration!E8,0)","v":0}]
{"$rows_left_out":32}
{"sheet":"Ausdruck","index":7,"n_rows":76,"n_cols":12,"rows_kept":76,"cut":false,"hidden":false,"merged":[[61,5,61,7],[61,8,61,11],[63,9,63,11],[64,9,64,11],[48,9,48,11],[49,9,49,11],[50,9,50,11],[51,9,51,11],[52,9,52,11],[53,9,53,11],[54,9,54,11],[55,9,55,11],[60,5,60,7],[60,8,60,11],[65,9,65,11],[71,9,71,11],[72,9,72,11],[73,9,73,11],[74,9,74,11],[66,9,66,11],[67,9,67,11],[68,9,68,11],[69,9,69,11],[70,9,70,11],[45,9,45,11],[46,9,46,11],[47,9,47,11],[29,5,30,11],[31,5,32,11],[33,5,34,11],[36,2,36,3],[37,2,37,3],[38,2,38,3],[41,0,41,3],[41,5,41,7],[41,8,41,11],[42,5,42,7],[8,1,8,2],[35,2,35,3],[24,0,24,11],[27,2,27,3],[28,2,28,3],[29,2,29,3],[30,2,30,3],[42,8,42,11],[44,9,44,11],[21,9,21,10],[21,0,21,1],[21,2,21,3],[21,4,21,5],[21,7,21,8],[26,5,27,9],[26,10,27,11],[35,5,36,11],[26,2,26,3],[18,0,18,2],[19,0,19,2],[14,1,14,2],[15,1,15,2],[9,1,9,2],[10,1,10,2],[0,0,0,11],[1,0,1,1],[1,2,1,4],[1,6,1,11],[3,1,3,2],[4,1,4,2],[5,1,5,2],[6,1,6,2],[7,1,7,2],[73,1,73,2],[74,1,74,2],[75,1,75,2],[44,1,44,2],[45,1,45,2],[46,1,46,2],[47,1,47,2],[48,1,48,2],[49,1,49,2],[50,1,50,2],[51,1,51,2],[52,1,52,2],[53,1,53,2],[54,1,54,2],[55,1,55,2],[56,1,56,2],[68,1,68,2],[69,1,69,2],[70,1,70,2],[71,1,71,2],[72,1,72,2],[63,1,63,2],[64,1,64,2],[65,1,65,2],[66,1,66,2],[67,1,67,2],[60,0,60,3],[11,1,11,2],[12,1,12,2],[13,1,13,2],[39,0,39,1],[39,2,39,3],[31,2,31,3],[32,2,32,3],[33,2,33,3],[34,2,34,3]]}
[]
[{"$f":"Einstellung!B5","v":"Tierhaltungsschule"},null,{"$f":"Einstellung!D5","v":"Triesdorf"},null,null,null,{"$f":"Ration!A2","v":"Bitte Sollwerte auswählen  !!!"}]
[]
["FM kg","Futterart",null,"TM kg","aNDFom","XP g","ME MJ","Ca g","P g","Mg g","Na g","Kosten"]
[{"$f":"Ration!E4","v":0},{"$f":"Ration!B15","v":0},null,{"$f":"IF(Ration!F15=\"TM o. FM?\",\" \",Ration!F15)","v":0},{"$f":"Ration!G15","v":0},{"$f":"Ration!H15","v":0},{"$f":"Ration!I15","v":0},{"$f":"Ration!L15","v":0},{"$f":"Ration!M15","v":0},{"$f":"Ration!N15","v":0},{"$f":"Ration!P15","v":0},{"$f":"Ration!Q15","v":0}]
[{"$f":"Ration!E5","v":0},{"$f":"Ration!B16","v":0},null,{"$f":"IF(Ration!F16=\"TM o. FM?\",\" \",Ration!F16)","v":0},{"$f":"Ration!G16","v":0},{"$f":"Ration!H16","v":0},{"$f":"Ration!I16","v":0},{"$f":"Ration!L16","v":0},{"$f":"Ration!M16","v":0},{"$f":"Ration!N16","v":0},{"$f":"Ration!P16","v":0},{"$f":"Ration!Q16","v":0}]
[{"$f":"Ration!E6","v":0},{"$f":"Ration!B17","v":0},null,{"$f":"IF(Ration!F17=\"TM o. FM?\",\" \",Ration!F17)","v":0},{"$f":"Ration!G17","v":0},{"$f":"Ration!H17","v":0},{"$f":"Ration!I17","v":0},{"$f":"Ration!L17","v":0},{"$f":"Ration!M17","v":0},{"$f":"Ration!N17","v":0},{"$f":"Ration!P17","v":0},{"$f":"Ration!Q17","v":0}]
[{"$f":"Ration!E7","v":0},{"$f":"Ration!B18","v":0},null,{"$f":"IF(Ration!F18=\"TM o. FM?\",\" \",Ration!F18)","v":0},{"$f":"Ration!G18","v":0},{"$f":"Ration!H18","v":0},{"$f":"Ration!I18","v":0},{"$f":"Ration!L18","v":0},{"$f":"Ration!M18","v":0},{"$f":"Ration!N18","v":0},{"$f":"Ration!P18","v":0},{"$f":"Ration!Q18","v":0}]
{"$rows_left_out":68}